program: Gaussian 09
title: 000283300
version: EM64L-G09RevD.01
frameworkgroup: C1[X(C15H13N)]
method: RPBEPBE
basis: SDD
operation: Freq
keyword: #pfreq=noraman
keyword: PBEPBE/SDD
title: #p freq=noraman PBEPBE/SDD
converged: NO NO NO NO
title: Mulliken charges:
elementType: N C C C C C C C C C C C C C C C H H H H H H H H H H H H H
charge: -0.007950 0.342405 0.223985 0.243160 0.324207 -0.629170 0.499088 -0.070076 -0.600195 -0.559316 -0.353854 -0.840821 -0.315150 -0.819646 -0.262962 -0.234606 0.229825 0.237391 0.254987 0.219816 0.235346 0.237988 0.235326 0.261856 0.232154 0.226865 0.232150 0.226562 0.230634
chargesum: 0.00000
title: Mulliken charges with hydrogens summed into heavy atoms:
elementType: N C C C C C C C C C C C C C C C
charge: -0.007950 0.342405 0.223985 0.243160 0.324207 -0.399346 0.499088 -0.070076 -0.362804 -0.304329 -0.134038 -0.132161 -0.053294 -0.128476 -0.036400 -0.003971
polarizability: 2.72820824e+02 3.87380913e+00 1.87390348e+02 -2.56785745e-04 -2.80977270e-03 7.43430203e+01
1716.lowfreq: -6.3016 -0.0009 -0.0004 0.0005 8.9860 14.2229 69.4328 79.7700 89.2693
frequency: 69.4272 79.7652 89.2687 169.0770 183.3639 185.6858 200.2009 247.2369 271.6670 301.2174 328.4300 402.0822 427.2847 458.6860 477.4540 510.2924 521.2283 546.5242 549.4527 581.7116 614.9149 633.0146 680.8392 739.2679 761.4671 772.8420 803.9622 853.9261 874.5840 881.8217 883.0445 904.9504 931.3670 962.9583 967.8349 982.1228 993.6846 1021.7321 1028.4856 1045.3395 1053.3226 1084.0699 1122.4078 1170.5948 1181.4610 1200.6598 1251.5241 1261.9295 1268.5809 1315.9323 1368.9247 1383.9098 1394.5500 1399.1687 1403.7462 1423.9802 1426.2888 1446.5167 1468.6969 1472.0667 1472.7642 1474.0765 1491.9828 1516.4863 1566.3925 1584.8569 1616.3688 1625.0256 2973.0428 2975.0276 3050.1624 3051.5300 3081.8999 3082.7211 3114.4889 3119.4346 3126.5992 3136.7490 3143.6170 3156.9333 3170.9264
redmass: 3.7530 1.3377 2.1913 2.1729 1.7959 3.7805 1.8295 3.7862 2.6816 4.7386 4.2453 5.5503 2.9504 5.1570 3.4864 3.6191 6.7610 3.2828 5.4078 3.2190 3.0842 6.3771 5.6513 3.1995 5.6278 1.3747 2.1609 4.6996 1.4566 5.9766 1.9186 1.4170 1.4853 1.3861 4.5635 1.6530 1.3306 1.4394 2.1225 1.5435 1.6190 2.5493 2.2301 1.2845 1.7122 2.2020 2.0947 1.5632 1.8486 3.8396 2.8966 2.5571 2.3075 1.2593 1.5196 2.6013 3.0628 3.1490 1.0458 1.4644 1.0459 1.7277 1.4929 3.2617 7.2288 6.7511 6.2428 6.0507 1.0375 1.0376 1.0972 1.0972 1.0988 1.0984 1.0914 1.0900 1.0853 1.0910 1.0894 1.0950 1.0990
irintensity: 0.7772 1.7823 0.2304 2.3790 0.4912 0.4482 0.1092 0.8423 1.1142 0.2911 0.6338 0.9570 5.4912 0.6786 0.5315 0.6888 0.5622 2.5713 4.4725 3.9385 4.8710 4.5584 2.5130 0.7296 0.8698 87.0364 3.7489 5.6965 15.2578 4.8424 2.1429 0.1892 15.4440 4.3324 0.8139 2.6552 0.2569 3.7192 6.8872 0.0030 19.8095 0.3426 8.1352 0.6974 5.3882 0.3004 13.1672 0.6186 2.4593 1.5087 0.9623 3.2371 18.8207 16.4652 4.2725 3.5534 3.8321 12.4284 16.1163 24.0590 12.0115 9.2774 26.1772 5.9713 8.6733 27.5767 4.6026 57.9916 36.3606 28.7532 16.9818 18.0705 13.5665 22.6876 24.9076 21.3016 1.5922 4.0250 13.2326 31.3658 24.7340
temp: 298.150 k
press: 1.00000 atm
elementType: 7 6 6 6 6 6 6 6 6 6 6 6 6 6 6 6 1 1 1 1 1 1 1 1 1 1 1 1 1
symmnumber: 1
zpe: 613490.7 jmol-1
zpe.correction: 0.233666 hartree
zpe.thermalcorrener: 0.246636 hartree
zpe.thermalcorrenthalpy: 0.247580 hartree
zpe.thermalcorrgfe: 0.194557 hartree
zpe.sumelectzpe: -633.078488 hartree
zpe.sumelectthermal: -633.065519 hartree
zpe.sumelectthermalent: -633.064575 hartree
zpe.sumelectthermalfe: -633.117597 hartree
dipole: -2.3886 2.1331 -0.0001
dipole: 3.2024
quadrupole: -78.8846 -87.1472 -99.0518
quadrupole: 5.7734 -0.0022 0.0010
quadrupole: 9.4766 1.2140 -10.6906 5.7734 -0.0022 0.0010
hfenergy: -633.3121547 hartree
pointgroup: C01 [X(C15H13N1)]
dipole: 0.9382165 0.840921 -0.00178 debye
polarizability: 272.8256634|-3.7077307|187.3659565|1.3555311|-1.103677|74.3625727 unknown
InChI: InChI=1S/C15H13N/c1-10-7-11(2)14-9-16-15-6-4-3-5-12(15)13(14)8-10/h3-9H,1-2H3
charge 0 multiplicity 1
29 atoms
N  -1.280628 -2.076231 0.009585
C  0.292375 0.360733 -0.003126
C  0.912167 -0.938652 0.013488
C  -1.170259 0.422467 -0.013486
C  2.347873 -1.056665 0.024327
C  1.121889 1.522307 -0.008771
C  2.520849 1.417536 0.001682
C  -1.905806 -0.817004 -0.006583
C  3.116352 0.115941 0.018284
C  0.050211 -2.106353 0.018847
C  -1.911089 1.644532 -0.029953
C  3.028033 -2.41472 0.041836
C  -3.332288 -0.805001 -0.016103
C  3.406762 2.649236 -0.00441
C  -3.312671 1.639796 -0.039079
C  -4.032153 0.407671 -0.032124
H  0.6683 2.518882 -0.021532
H  4.211267 0.03784 0.02637
H  0.506167 -3.103694 0.031485
H  -1.383356 2.603952 -0.035649
H  2.760408 -3.02128 -0.844273
H  4.125464 -2.301025 0.048556
H  2.747743 -3.004683 0.935193
H  -3.843719 -1.77229 -0.010265
H  4.071444 2.660386 -0.88947
H  2.813226 3.579517 -0.017352
H  4.059764 2.67764 0.888917
H  -3.862046 2.587891 -0.051669
H  -5.127778 0.415767 -0.039326
