program: Gaussian 09
title: 000028212
version: EM64L-G09RevD.01
frameworkgroup: C1[X(C14H18IN3)]
method: RPBEPBE
basis: SDD
operation: Freq
keyword: #p
keyword: freq=noraman
keyword: PBEPBE/SDD
title: #p freq=noraman PBEPBE/SDD
converged: YES YES NO NO
title: Mulliken charges:
elementType: I N N N C C C C C C C C C C C C C C H H H H H H H H H H H H H H H H H H
charge: 0.092644 -0.099584 -0.416486 -0.047780 -0.476604 -0.327601 -0.338525 0.373392 0.266091 -0.026016 -0.616784 -0.610422 -0.320641 -0.338446 -0.232194 -0.387175 -0.217907 -0.349712 0.220421 0.200123 0.194768 0.209443 0.223008 0.249106 0.296083 0.222057 0.191367 0.228231 0.232574 0.223431 0.190121 0.234823 0.196130 0.280538 0.233203 0.248324
chargesum: 0.00000
title: Mulliken charges with hydrogens summed into heavy atoms:
elementType: I N N N C C C C C C C C C C C C C C
charge: 0.092644 -0.099584 -0.120403 -0.047780 -0.056060 0.076611 0.133589 0.373392 0.266091 -0.026016 0.024870 0.035704 -0.085819 -0.142316 0.048344 -0.153972 0.030417 -0.349712
polarizability: 3.13534552e+02 2.92183977e+01 1.89435334e+02 -1.90161626e+01 2.31169479e+01 1.20987557e+02
1716.lowfreq: -10.2036 -4.6355 0.0002 0.0003 0.0004 3.6627 16.5458 17.5059 30.9200
frequency: 15.6533 17.3436 30.9024 49.6607 72.8457 96.7356 118.5082 149.9095 170.3483 196.9149 205.5238 223.5031 231.2707 235.0940 272.1838 303.4913 334.8800 354.1809 373.8196 404.0492 412.9756 430.3799 472.6057 500.5712 503.3276 528.7469 553.8398 612.0315 629.9204 643.2268 731.8086 748.8014 760.9420 810.5782 818.4577 824.2690 837.2482 858.1280 888.3290 906.6218 937.8279 949.6592 952.0460 999.6396 1033.6799 1035.8672 1057.1048 1072.3109 1082.4856 1090.9600 1097.7398 1115.9903 1137.0616 1168.9946 1185.1251 1206.2084 1213.2003 1246.5659 1263.9958 1268.8968 1294.2583 1309.2193 1328.2057 1340.4913 1353.1351 1366.7916 1374.3669 1391.7281 1408.7791 1419.6289 1434.0737 1440.4428 1456.8352 1461.9619 1463.9498 1472.1173 1475.0932 1477.7745 1485.8050 1489.0615 1521.6834 1555.2499 1583.0494 1600.1185 2849.1057 2853.5794 2870.3769 2944.7505 2977.7149 3018.4641 3022.5550 3024.8075 3027.8031 3050.4751 3080.0354 3084.0002 3112.7083 3117.9153 3169.5583 3176.8731 3179.4510 3563.9645
redmass: 4.1361 4.3131 2.9617 4.9294 3.6994 4.9113 3.4847 5.7290 2.5182 5.8211 1.7940 1.6161 1.2952 3.4910 4.2637 2.3265 4.1026 2.3370 1.6414 1.9226 2.0236 2.2078 3.6297 3.3597 3.9816 3.6345 8.0441 5.7077 6.4632 3.3524 2.8240 4.0547 1.8317 2.1918 5.9230 1.6421 2.3130 3.4394 2.5342 1.4867 1.3589 1.9745 1.4161 2.2755 2.6344 1.5039 2.0132 1.7568 1.6359 1.7439 2.4853 2.0021 1.5000 1.4563 2.2626 1.8358 1.3432 1.4385 1.8059 2.0661 1.2965 2.1325 1.8100 1.6528 1.5240 1.4699 1.9213 4.4689 2.4962 1.1411 2.4230 1.1572 1.3572 1.0723 1.3254 1.2859 1.0562 1.0903 1.0559 1.0841 4.9503 3.7040 6.3562 6.3968 1.0685 1.0568 1.0587 1.0649 1.0669 1.0880 1.0734 1.0954 1.0733 1.0952 1.1009 1.1006 1.0883 1.0900 1.0950 1.0932 1.0931 1.0759
irintensity: 0.5618 0.1309 0.4452 0.1263 0.2153 0.9677 0.4896 0.2063 2.2189 3.9161 0.9433 0.2079 1.3953 0.3210 0.3040 9.1165 13.3623 1.9257 53.2616 17.3257 4.8767 56.2874 3.2899 10.4848 3.9620 1.7124 11.8731 0.8637 3.8807 9.4577 26.4607 2.4326 17.6743 42.7825 65.8303 25.0273 11.1602 29.8080 1.5198 19.8983 0.1475 7.5669 1.5485 29.4000 13.8269 9.8725 9.2604 12.0104 0.9809 15.6044 1.4926 40.9144 2.3371 13.7760 13.1264 2.8989 60.7312 1.3014 4.4994 9.9082 3.6150 25.6069 25.1541 49.1946 1.3502 10.1807 7.7894 79.5759 9.5995 2.7049 42.3164 5.6685 22.9444 22.0570 33.5409 10.0337 13.7478 17.5196 12.0518 81.0726 43.7593 112.2510 427.7701 87.3299 49.4151 74.7523 278.3993 51.2241 47.1159 12.1642 28.4005 27.7789 35.0207 64.1375 26.1321 50.1410 18.2497 31.1636 8.1611 20.7100 0.1323 23.9744
temp: 298.150 k
press: 1.00000 atm
elementType: 53 7 7 7 6 6 6 6 6 6 6 6 6 6 6 6 6 6 1 1 1 1 1 1 1 1 1 1 1 1 1 1 1 1 1 1
symmnumber: 1
zpe: 772027.7 jmol-1
zpe.correction: 0.294050 hartree
zpe.thermalcorrener: 0.312328 hartree
zpe.thermalcorrenthalpy: 0.313272 hartree
zpe.thermalcorrgfe: 0.243633 hartree
zpe.sumelectzpe: -718.700058 hartree
zpe.sumelectthermal: -718.681779 hartree
zpe.sumelectthermalent: -718.680835 hartree
zpe.sumelectthermalfe: -718.750475 hartree
dipole: 6.6716 -3.2958 -1.9444
dipole: 7.6911
quadrupole: -105.3859 -124.0083 -122.9739
quadrupole: 0.4881 -2.7371 0.8156
quadrupole: 12.0701 -6.5523 -5.5178 0.4881 -2.7371 0.8156
hfenergy: -718.9941073 hartree
pointgroup: C01 [X(C14H18I1N3)]
dipole: 2.8177986 -0.6387739 -0.8990079 debye
polarizability: 298.7019278|53.0907159|194.6377738|-13.7431176|32.7444727|130.6177413 unknown
InChI: InChI=1S/C14H18IN3/c1-18(2)9-3-7-16-13-6-8-17-14-10-11(15)4-5-12(13)14/h4-6,8,10,16H,3,7,9H2,1-2H3
charge 0 multiplicity 1
36 atoms
I  -5.836068 -2.167828 -0.215801
N  4.381107 -0.55085 0.719402
N  0.99996 0.263989 -0.931702
N  -2.411852 1.928697 1.06333
C  3.383837 -0.048692 -1.536481
C  3.76707 -1.130883 -0.498226
C  2.313234 0.924527 -1.007453
C  -0.101024 0.796595 -0.288031
C  -1.376829 0.091082 -0.288309
C  -2.492143 0.710767 0.395987
C  5.776939 -0.112674 0.516516
C  4.245426 -1.424768 1.903533
C  -0.044502 2.033093 0.396736
C  -1.583363 -1.174012 -0.921255
C  -3.76541 0.049483 0.404828
C  -1.20515 2.535502 1.043969
C  -2.829483 -1.810489 -0.903282
C  -3.919582 -1.179152 -0.233549
H  4.278307 0.535025 -1.822141
H  3.031442 -0.542107 -2.466785
H  4.437122 -1.886375 -0.983307
H  2.85055 -1.667566 -0.18694
H  2.255475 1.826669 -1.653841
H  2.62467 1.245451 0.005039
H  0.869583 -0.559505 -1.518602
H  5.838583 0.619393 -0.307239
H  6.470835 -0.959015 0.278744
H  6.144469 0.383954 1.431988
H  3.179183 -1.650994 2.079942
H  4.633327 -0.90106 2.795733
H  4.797458 -2.39411 1.809173
H  0.877031 2.618469 0.43068
H  -0.763074 -1.691416 -1.434215
H  -4.581776 0.552517 0.92887
H  -1.146706 3.495552 1.572026
H  -2.964145 -2.779269 -1.391838
