program: Gaussian 09
title: 000283271
version: EM64L-G09RevD.01
frameworkgroup: C1[X(C6H9Br2NO)]
method: RPBEPBE
basis: SDD
operation: Freq
keyword: #p
keyword: freq=noraman
keyword: PBEPBE/SDD
title: #p freq=noraman PBEPBE/SDD
converged: YES YES NO NO
title: Mulliken charges:
elementType: Br Br O N C C C C C C H H H H H H H H H
charge: 0.118536 0.044416 -0.224576 -0.314662 -0.398977 -0.336925 -0.346621 -0.614512 -0.407123 0.299383 0.224227 0.230971 0.245294 0.264368 0.208879 0.210724 0.244330 0.219701 0.332564
chargesum: 0.00000
title: Mulliken charges with hydrogens summed into heavy atoms:
elementType: Br Br O N C C C C C C
charge: 0.118536 0.044416 -0.224576 0.017902 0.056221 0.172737 0.072983 -0.614512 0.056909 0.299383
polarizability: 1.28948520e+02 8.37298750e+00 1.01102919e+02 1.05861571e+00 -1.13007621e+00 8.56216313e+01
1716.lowfreq: -9.0418 -5.4366 -0.0007 -0.0003 -0.0002 10.4078 68.0565 116.4433 126.3090
frequency: 68.0549 116.4326 126.3048 149.6468 188.2753 213.3562 230.0223 274.9972 336.4723 372.7655 387.7617 425.6061 479.6797 565.4363 596.1951 694.1646 724.1616 735.6472 815.0295 868.9806 886.8545 923.4363 969.8312 1059.2044 1081.3525 1099.5297 1135.8891 1194.3196 1228.2863 1268.4052 1275.8177 1325.4068 1341.2640 1353.9107 1369.9438 1383.2812 1427.1801 1440.4191 1455.2976 1463.0932 1480.8623 1609.5287 2981.9142 2985.3679 2989.6767 2992.7570 3040.0745 3053.1036 3063.4385 3065.2706 3520.9825
redmass: 9.0634 3.5405 7.2641 10.4252 4.2539 6.8656 6.6167 2.4689 2.0136 5.2660 3.6370 4.1381 2.3232 2.4914 1.5948 3.3585 3.1286 4.2366 2.4047 2.1070 1.9713 2.6522 2.1617 2.5802 2.4766 2.3300 2.2049 1.4487 1.2547 1.2024 1.5598 1.5104 1.4649 1.4213 1.4668 1.5385 1.4413 1.0877 1.0925 1.0897 1.1050 5.4118 1.0602 1.0639 1.0648 1.0620 1.1003 1.0992 1.1001 1.0990 1.0758
irintensity: 2.2137 0.0559 1.2838 0.1872 1.5419 0.3963 1.0921 1.8701 0.0605 7.9370 5.0621 25.2627 5.0549 2.3588 81.7921 101.1930 9.7331 63.1644 13.0900 23.9101 13.1393 6.6217 30.4982 4.2688 11.0505 13.3290 6.7153 2.6587 1.5887 13.8502 26.4284 61.8537 9.4773 3.8246 5.7459 20.5354 5.9283 12.6878 10.0419 19.7424 20.4882 214.6711 24.4660 9.8031 27.5802 33.0066 25.0931 39.5247 19.4891 22.9046 30.9132
temp: 298.150 k
press: 1.00000 atm
elementType: 35 35 8 7 6 6 6 6 6 6 1 1 1 1 1 1 1 1 1
symmnumber: 1
zpe: 381816.2 jmol-1
zpe.correction: 0.145426 hartree
zpe.thermalcorrener: 0.155916 hartree
zpe.thermalcorrenthalpy: 0.156860 hartree
zpe.thermalcorrgfe: 0.107858 hartree
zpe.sumelectzpe: -390.151542 hartree
zpe.sumelectthermal: -390.141052 hartree
zpe.sumelectthermalent: -390.140108 hartree
zpe.sumelectthermalfe: -390.189109 hartree
dipole: 5.5433 0.1010 2.4239
dipole: 6.0510
quadrupole: -69.8809 -81.9319 -77.3377
quadrupole: -5.5082 -4.2278 -2.4620
quadrupole: 6.5026 -5.5484 -0.9542 -5.5082 -4.2278 -2.4620
hfenergy: -390.2969676 hartree
pointgroup: C01 [X(C6H9Br2N1O1)]
dipole: -2.3580165 -0.2842499 0.1623391 debye
dipolederiv: -0.6018529 0.1013499 -0.2055801 0.1449925 -0.0524403 0.0867194 -0.1746011 0.0588994 -0.1737469 -0.1635333 0.0039833 -0.091525 0.0111916 -0.1888838 -0.1070397 -0.0787139 -0.0888616 -0.7722339 -0.8904511 -0.0940518 -0.1257583 -0.30818 -0.7341605 -0.2026269 -0.2088421 -0.0770371 -0.3369218 -1.0199002 -0.0439245 -0.0223497 0.4325763 -0.4011701 0.0874434 0.0217121 0.0134789 -0.4291023 0.0870033 -0.0046787 -0.0254582 -0.0739322 0.096388 0.0180046 0.1026437 0.0188652 0.1021592 -0.1570642 0.0312926 -0.0251143 0.0869569 -0.0573964 -0.0367647 -0.0153189 0.0397005 -0.1329828 0.0281407 -0.0118336 -0.0005173 -0.0190984 0.0261687 0.0376911 -0.0132254 0.0686593 0.1072657 0.8872623 -0.1845476 0.3284683 -0.0717518 -0.017754 -0.1000758 0.2424177 -0.0869189 1.1241431 0.5014637 0.1138662 0.0313882 0.160443 0.2142907 0.0160088 0.0623215 0.0143154 0.2651934 1.2901017 0.0695543 0.1562431 -0.3126159 0.9722475 0.2903607 0.2012128 0.1838568 0.0827096 -0.0389031 -0.0601866 0.052302 -0.0679865 -0.0696339 0.0976152 0.060166 0.120938 0.0183949 0.0548701 0.0375166 0.0005797 0.0454988 0.0492461 -0.0422644 -0.0584515 -0.0938153 -0.0919943 0.0350071 -0.0205918 0.0347329 -0.0542508 0.0746127 -0.0154209 -0.0125681 -0.0377144 -0.0889542 0.0306712 0.0488841 0.0006824 0.0561625 -0.0710041 0.0065188 0.0093454 -0.0147252 0.1005948 -0.1997628 -0.0180287 -0.0388513 -0.045994 0.0454981 0.0009814 -0.0813845 0.0063084 0.0714126 0.0989989 -0.0026392 -0.0331146 0.0272598 0.0017334 -0.0539188 0.0435104 -0.0548955 -0.1399259 0.0216369 -0.0411175 0.040995 -0.0982089 0.0635227 -0.0802245 -0.0370609 -0.0363854 -0.0972436 -0.0511371 0.0814814 -0.0263297 0.1131997 -0.102727 0.0249601 0.0064372 -0.0109551 0.0985121 0.0874488 -0.0063284 -0.0507931 -0.0262627 0.1514622 -0.0279679 -0.0696005 -0.0237134 0.2927201 unknown
polarizability: 126.5901411|-5.5309847|88.5628019|11.4858016|3.7305191|100.5201274 unknown
InChI: InChI=1S/C6H9Br2NO/c7-6(8)3-1-2-4-9-5(6)10/h9H,1-4H2
charge 0 multiplicity 1
19 atoms
Br 2.699088 -1.023145 0.550648
Br 0.746195 -0.840411 -2.073054
O  1.629821 1.767793 0.563784
N  -0.587652 1.584859 -0.009768
C  -1.627146 -1.460778 0.266445
C  -0.145153 -1.433811 0.710042
C  -2.401366 -0.135006 0.402808
C  0.834006 -0.500994 -0.037196
C  -1.848969 0.989266 -0.497352
C  0.668662 1.03885 0.18811
H  -2.123246 -2.234157 0.884256
H  -1.682666 -1.812296 -0.781555
H  -0.073781 -1.149778 1.780231
H  0.255043 -2.459759 0.626758
H  -3.456333 -0.314849 0.117393
H  -2.403321 0.210823 1.455047
H  -1.720256 0.611103 -1.530181
H  -2.579259 1.816454 -0.539267
H  -0.585266 2.595739 0.154148
