program: Gaussian 09
title: 000283270
version: EM64L-G09RevD.01
frameworkgroup: C1[X(C14H22FOP)]
method: RPBEPBE
basis: SDD
operation: Freq
keyword: #p
keyword: freq=noraman
keyword: PBEPBE/SDD
title: #p freq=noraman PBEPBE/SDD
converged: YES YES NO NO
title: Mulliken charges:
elementType: P F O C C C C C C C C C C C C C C H H H H H H H H H H H H H H H H H H H H H H
charge: 1.209836 -0.409481 -0.622486 -0.125302 0.132263 -0.261593 0.497815 -0.677948 -0.656063 -0.682309 -0.263869 -0.306452 -0.396115 -0.398489 -0.693630 -0.697142 -0.745877 0.251042 0.222622 0.228944 0.240602 0.253017 0.209920 0.233103 0.220445 0.243502 0.262121 0.276181 0.211288 0.215199 0.227166 0.216674 0.212749 0.222932 0.220149 0.219770 0.216410 0.236007 0.256998
chargesum: 0.00000
title: Mulliken charges with hydrogens summed into heavy atoms:
elementType: P F O C C C C C C C C C C C C C C
charge: 1.209836 -0.409481 -0.622486 -0.125302 0.132263 -0.261593 0.497815 0.024660 0.047477 0.014741 -0.001748 -0.030271 -0.160108 -0.141490 -0.039977 -0.044787 -0.089548
polarizability: 2.42437051e+02 -2.84796929e+00 1.59542338e+02 -8.91793402e-01 -1.10768277e+01 1.36664596e+02
1716.lowfreq: -30.1083 -8.8466 -4.3529 0.0020 0.0021 0.0021 8.4912 27.9542 39.1477
frequency: -22.6438 25.1464 38.5609 66.6094 93.8919 104.4147 158.8358 176.2958 181.1194 194.6093 199.4069 210.1719 234.9583 243.2548 251.8449 255.9039 264.0856 277.4902 307.1434 312.3647 329.5728 335.7837 348.9976 374.8128 381.4640 404.9448 407.9836 438.3514 460.2296 467.6562 540.4059 564.1160 604.8476 627.3100 650.6665 735.0648 750.9643 797.0867 833.6948 849.6389 861.4853 920.4297 932.8643 940.9014 942.0323 944.0767 955.6421 969.5449 984.6418 1005.7787 1011.2855 1014.7968 1021.6190 1025.9002 1034.2062 1088.5168 1120.8672 1129.5226 1189.7498 1202.3779 1207.4887 1217.0433 1217.7074 1226.1504 1272.1346 1309.1303 1358.1598 1377.8015 1377.9510 1379.4389 1381.4903 1401.1358 1407.2555 1407.9853 1451.3387 1460.4592 1465.4605 1465.8619 1467.1484 1469.5128 1474.9228 1478.7486 1479.2794 1488.1121 1489.1887 1495.1291 1499.1869 1567.8258 1605.7078 2973.6227 2974.2105 2976.0558 2977.2809 2980.7539 2981.8948 3066.6281 3070.3208 3070.4490 3071.7793 3072.0303 3079.0158 3079.1343 3080.1358 3082.6639 3083.8516 3089.1042 3094.8673 3133.2331 3138.8218 3159.5795 3170.2679
redmass: 2.7270 3.3585 3.8333 3.6674 4.4052 5.3875 2.5137 1.4519 2.4586 2.2582 2.5709 1.9172 1.2585 2.1541 2.2654 1.2993 1.2773 2.7317 1.3841 1.7441 3.4154 2.8641 3.0763 2.9255 2.6705 2.8460 3.3358 3.7945 2.9891 3.6245 3.2182 2.8752 4.8444 7.2527 11.8424 5.9505 3.6685 3.0189 2.6234 1.5403 1.2730 1.7438 1.6453 1.6534 1.5921 1.2078 1.2080 1.3324 1.3761 3.3635 1.5847 1.5079 1.4639 1.3859 5.8274 4.6810 1.9157 1.5766 2.0575 2.9405 1.1601 2.4724 2.8117 2.9428 3.0759 1.2756 4.5420 1.2775 1.1867 1.1972 1.1904 3.0888 1.1959 1.2036 1.0460 1.0506 1.0479 1.0491 1.1096 1.0486 1.0503 1.1043 1.0810 1.0500 1.5485 1.0660 1.1378 6.7334 5.9997 1.0353 1.0350 1.0349 1.0356 1.0359 1.0359 1.0998 1.1002 1.0990 1.1001 1.1002 1.0994 1.0992 1.0989 1.1004 1.0992 1.1003 1.1004 1.0875 1.0897 1.0955 1.0943
irintensity: 0.0208 1.0622 1.0661 0.3868 0.3758 1.0665 0.4676 2.7051 5.9980 1.4194 1.1917 4.6919 1.0858 6.2695 9.0499 2.6841 1.7734 1.9406 0.5352 0.7953 4.3127 4.6172 0.2485 4.2359 0.8685 0.1328 0.3209 11.7307 0.7676 43.5924 6.3808 21.1345 90.6540 19.6211 90.3787 16.7326 2.5517 14.2414 10.5950 31.9858 4.6217 3.7332 2.4493 3.1913 2.5040 0.0732 0.0608 0.1407 0.2787 11.2053 0.5811 6.9734 2.8076 0.4029 64.5397 101.2950 2.6189 3.0855 45.3633 5.5633 0.0991 1.7014 2.1366 1.8922 29.8706 1.2202 4.1933 22.4318 19.7068 19.2103 20.1283 18.5287 17.4977 7.5144 0.8233 0.0498 0.5204 0.9585 2.2687 2.7455 16.3374 13.6189 14.2628 12.6583 5.8640 31.6748 28.3151 1.2944 32.4949 16.5654 29.1288 30.0846 21.8181 32.9973 29.7671 0.1735 2.9275 53.9970 3.9551 19.0753 53.1807 36.1190 85.6086 12.4995 43.3731 17.7986 19.0547 12.6129 0.1188 9.2969 7.7023
temp: 298.150 k
press: 1.00000 atm
elementType: 15 9 8 6 6 6 6 6 6 6 6 6 6 6 6 6 6 1 1 1 1 1 1 1 1 1 1 1 1 1 1 1 1 1 1 1 1 1 1
symmnumber: 1
zpe: 855930.4 jmol-1
zpe.correction: 0.326007 hartree
zpe.thermalcorrener: 0.345403 hartree
zpe.thermalcorrenthalpy: 0.346347 hartree
zpe.thermalcorrgfe: 0.279318 hartree
zpe.sumelectzpe: -1061.679905 hartree
zpe.sumelectthermal: -1061.660509 hartree
zpe.sumelectthermalent: -1061.659565 hartree
zpe.sumelectthermalfe: -1061.726594 hartree
dipole: -3.3565 3.6244 3.2625
dipole: 5.9200
quadrupole: -102.1030 -115.7945 -115.5489
quadrupole: 10.8435 8.6368 -4.5971
quadrupole: 9.0458 -4.6457 -4.4001 10.8435 8.6368 -4.5971
hfenergy: -1062.0059121 hartree
pointgroup: C01 [X(C14H22F1O1P1)]
dipole: 1.347226 1.6917049 0.8647917 debye
polarizability: 242.4579408|0.0163154|132.1539001|2.4958202|-0.4406747|164.0321453 unknown
InChI: InChI=1S/C14H22FOP/c1-13(2,3)11-7-9-12(10-8-11)17(15,16)14(4,5)6/h7-10H,1-6H3
charge 0 multiplicity 1
39 atoms
P  -2.321773 -0.593087 -0.436751
F  -2.617579 -1.757976 0.862894
O  -2.771915 -1.098651 -1.88045
C  -3.345209 0.884021 0.229576
C  3.868418 0.140932 0.038035
C  -0.494085 -0.36226 -0.256537
C  2.336608 -0.027679 -0.091347
C  -3.08247 2.065309 -0.738266
C  -4.830727 0.448572 0.175679
C  -2.914848 1.233758 1.670972
C  0.159264 -0.470536 0.994474
C  0.259265 -0.103866 -1.423341
C  1.555348 -0.302655 1.066881
C  1.658459 0.064397 -1.334116
C  4.47982 -1.166036 0.62938
C  4.174632 1.333099 0.995081
C  4.549365 0.424243 -1.32555
H  -3.371502 1.807806 -1.772961
H  -3.688279 2.933068 -0.416808
H  -2.020458 2.374238 -0.735833
H  -5.030983 -0.3859 0.870366
H  -5.116755 0.129705 -0.842201
H  -5.466239 1.306093 0.466636
H  -1.857378 1.550733 1.723203
H  -3.535261 2.076079 2.031566
H  -3.06487 0.38156 2.356892
H  -0.413159 -0.715868 1.894686
H  -0.244915 -0.059819 -2.395324
H  5.576082 -1.059151 0.729332
H  4.069898 -1.395846 1.629017
H  4.274399 -2.030561 -0.027746
H  3.744703 1.173092 1.999874
H  5.267856 1.455325 1.110145
H  3.761221 2.276897 0.594791
H  5.638089 0.541445 -1.176083
H  4.398789 -0.405292 -2.040866
H  4.173972 1.356567 -1.786667
H  2.043994 -0.398847 2.042804
H  2.219426 0.26129 -2.251535
