program: Gaussian 09
title: 000283230
version: EM64L-G09RevD.01
frameworkgroup: C1[X(C15H14O2)]
method: RPBEPBE
basis: SDD
operation: Freq
keyword: #pfreq=noraman
keyword: PBEPBE/SDD
title: #p freq=noraman PBEPBE/SDD
converged: YES YES NO NO
title: Mulliken charges:
elementType: O O C C C C C C C C C C C C C C C H H H H H H H H H H H H H H
charge: -0.283503 -0.283525 -0.021043 0.433022 0.432801 -0.318864 -0.318609 -0.369350 -0.369344 -0.415572 -0.415480 -0.221831 -0.221802 -0.217380 -0.217359 -0.242731 -0.242729 0.232229 0.219054 0.232112 0.219018 0.245970 0.246004 0.273907 0.273904 0.224749 0.224755 0.224113 0.224119 0.226679 0.226687
chargesum: 0.00000
title: Mulliken charges with hydrogens summed into heavy atoms:
elementType: O O C C C C C C C C C C C C C C C
charge: -0.283503 -0.283525 -0.021043 0.433022 0.432801 0.132419 0.132521 -0.123380 -0.123339 -0.141666 -0.141576 0.002918 0.002953 0.006732 0.006760 -0.016053 -0.016042
polarizability: 1.84841899e+02 2.70657591e-03 1.44447846e+02 1.40663650e+01 1.80352514e-02 1.43550013e+02
1716.lowfreq: -2.8193 -0.0005 0.0006 0.0007 3.5129 11.3759 15.8298 20.6445 42.0318
frequency: 15.7391 20.5920 40.7603 56.7424 129.3662 170.0293 184.6034 241.9119 279.4790 306.4722 316.0325 350.4316 399.8508 400.1712 433.8627 502.5159 526.8011 605.7064 615.2760 617.6124 631.7479 658.0366 700.2707 702.6243 705.4121 758.4374 775.7478 855.1752 856.0754 865.0599 888.8048 912.6782 912.7379 928.4693 939.9989 961.5018 980.8683 981.6882 984.2570 990.2943 990.3761 998.3547 998.5207 1021.5196 1029.0541 1043.6182 1079.2630 1086.4714 1108.4827 1165.8582 1171.1951 1171.6444 1183.1379 1183.5564 1192.4669 1219.1986 1235.7892 1310.8740 1316.2310 1321.3309 1330.8944 1381.8466 1383.9023 1431.9760 1435.7145 1470.0080 1474.1641 1478.4145 1478.9791 1591.6164 1593.9792 1610.4449 1612.1583 2993.9831 2999.1863 3096.0679 3104.1552 3122.8472 3122.8862 3133.0980 3133.2591 3146.8556 3146.8567 3159.8787 3159.9490 3171.8262 3171.9938
redmass: 3.7801 3.7972 3.3499 5.1039 4.6190 3.0749 4.7218 3.3045 4.0741 6.5656 4.8703 5.2581 2.8502 2.8507 4.7409 4.3786 3.5456 2.7985 6.4186 4.4367 5.7592 6.5815 7.3535 1.8484 1.6909 1.7890 1.9939 1.2526 1.2919 2.5678 3.6728 3.2121 3.4649 1.6456 1.9664 3.1509 1.3920 1.4803 2.7007 5.8037 6.1128 1.3294 1.3308 3.1866 2.0270 2.9494 1.5793 1.5611 1.6989 1.1383 1.0535 1.0557 1.1153 1.2807 1.4881 2.1429 4.2732 1.3242 1.3140 1.2687 1.2351 9.3042 9.6603 2.1967 2.2318 1.0883 1.0997 2.2496 2.3034 6.3462 6.4345 6.1236 6.0955 1.0688 1.0600 1.0993 1.1050 1.0847 1.0846 1.0886 1.0887 1.0939 1.0939 1.0977 1.0979 1.0970 1.0972
irintensity: 0.0353 0.5470 8.9221 0.3131 2.1880 0.1697 1.6215 1.4530 0.1025 13.0221 0.5991 1.4016 0.2329 0.2281 6.1221 3.6189 14.8070 4.5365 0.0951 2.0889 37.7480 0.6177 7.7716 44.6565 64.4945 57.2482 56.5611 0.0419 0.5994 1.2025 41.3887 20.4921 30.5997 30.5823 7.0193 0.0947 1.0893 2.3491 6.8775 0.0718 0.9877 0.2019 4.5187 76.3721 8.7776 97.3362 1.0092 10.7618 1.8226 0.1019 0.7152 0.2601 11.2499 37.8313 32.1642 22.4268 58.7052 0.0319 5.6427 2.6440 3.0142 0.0390 1.5825 2.5971 22.0784 5.4834 1.3605 4.7864 12.3065 0.0619 1.0264 2.1281 0.0792 62.9907 62.0525 26.1018 30.6226 0.8805 0.0248 3.7262 17.8624 52.8841 6.1376 17.9813 28.1472 18.1716 2.7090
temp: 298.150 k
press: 1.00000 atm
elementType: 8 8 6 6 6 6 6 6 6 6 6 6 6 6 6 6 6 1 1 1 1 1 1 1 1 1 1 1 1 1 1
symmnumber: 1
zpe: 651771.7 jmol-1
zpe.correction: 0.248247 hartree
zpe.thermalcorrener: 0.262297 hartree
zpe.thermalcorrenthalpy: 0.263241 hartree
zpe.thermalcorrgfe: 0.204516 hartree
zpe.sumelectzpe: -729.210962 hartree
zpe.sumelectthermal: -729.196911 hartree
zpe.sumelectthermalent: -729.195967 hartree
zpe.sumelectthermalfe: -729.254693 hartree
dipole: -0.0084 1.4915 0.0022
dipole: 1.4916
quadrupole: -92.0975 -87.0872 -96.0041
quadrupole: -0.0215 2.7012 0.0077
quadrupole: -0.3678 4.6424 -4.2745 -0.0215 2.7012 0.0077
hfenergy: -729.4592083 hartree
pointgroup: C01 [X(C15H14O2)]
dipole: -0.0022049 0.5868191 0.0005909 debye
polarizability: 181.7815643|-0.0755718|144.447995|17.7442559|-0.0175137|146.6101991 unknown
InChI: InChI=1S/C15H14O2/c1-3-7-13(8-4-1)15(16-11-12-17-15)14-9-5-2-6-10-14/h1-10H,11-12H2
charge 0 multiplicity 1
31 atoms
O  -0.052635 1.678069 1.188226
O  0.058923 1.677948 -1.188437
C  0.001746 0.78128 0.0000
C  1.276954 -0.063827 0.090861
C  -1.276084 -0.060013 -0.090865
C  -0.350813 3.035798 0.682271
C  0.354649 3.036235 -0.682459
C  1.64943 -0.855769 -1.02424
C  -1.651218 -0.850353 1.024496
C  2.076573 -0.079561 1.257074
C  -2.075463 -0.073896 -1.257268
C  2.81655 -1.646571 -0.976024
C  -2.820693 -1.637664 0.976353
C  3.242983 -0.877939 1.305902
C  -3.244283 -0.86876 -1.306016
C  3.61694 -1.66225 0.191617
C  -3.620865 -1.651439 -0.19147
H  0.062712 3.748938 1.412534
H  -1.443849 3.176593 0.575697
H  -0.059978 3.748728 -1.41276
H  1.447435 3.178834 -0.575822
H  1.028857 -0.842976 -1.926875
H  -1.030802 -0.839022 1.92726
H  1.782702 0.538931 2.109931
H  -1.779435 0.543268 -2.110349
H  3.101776 -2.251503 -1.844155
H  -3.107937 -2.241372 1.844671
H  3.858363 -0.886124 2.212877
H  -3.859467 -0.875493 -2.213137
H  4.521442 -2.279957 0.23066
H  -4.527216 -2.266434 -0.230453
