program: Gaussian 09
title: 000283227
version: EM64L-G09RevD.01
frameworkgroup: C1[X(C17H12O2)]
method: RPBEPBE
basis: SDD
operation: Freq
keyword: #pfreq=noraman
keyword: PBEPBE/SDD
title: #p freq=noraman PBEPBE/SDD
converged: YES YES NO NO
title: Mulliken charges:
elementType: O O C C C C C C C C C C C C C C C C C H H H H H H H H H H H H
charge: -0.317322 -0.255342 0.260887 0.260882 0.331330 0.331334 -0.420817 -0.420809 0.205041 -0.368906 -0.368906 -0.351434 -0.351434 -0.237858 -0.237859 -0.224813 -0.224813 -0.236435 -0.236437 0.250520 0.250516 0.230649 0.230641 0.250893 0.250901 0.233451 0.233451 0.231174 0.231174 0.235171 0.235171
chargesum: 0.00000
title: Mulliken charges with hydrogens summed into heavy atoms:
elementType: O O C C C C C C C C C C C C C C C C C
charge: -0.317322 -0.255342 0.260887 0.260882 0.331330 0.331334 -0.170298 -0.170294 0.205041 -0.138258 -0.138264 -0.100541 -0.100533 -0.004407 -0.004408 0.006361 0.006361 -0.001263 -0.001266
polarizability: 2.87213574e+02 -8.02043346e-05 2.54901286e+02 -1.94342775e-02 1.11374001e+00 7.15158925e+01
1716.lowfreq: -29.3109 -7.1129 -1.9813 -0.0002 0.0005 0.0005 1.9310 4.7716 69.3076
frequency: -29.2951 -3.9514 69.3047 74.1611 97.1931 151.7126 165.6428 207.3469 217.2461 267.2364 276.2502 365.6961 396.6105 398.3927 405.7575 445.9431 455.1113 501.1311 554.3348 614.6262 616.9320 619.3178 625.3586 628.8935 658.5861 679.2798 690.3232 701.5850 780.1815 783.5931 817.5768 839.4273 849.8594 860.7916 878.3791 880.9758 902.3477 930.8741 935.4572 981.5810 984.1078 988.4404 990.6030 1001.7742 1003.0448 1006.9335 1021.7890 1033.8532 1040.9200 1087.0671 1089.1595 1175.3644 1176.5776 1191.3816 1199.4802 1239.9134 1246.7712 1251.8809 1299.5390 1311.5849 1331.1080 1340.0780 1385.8248 1386.2045 1438.6800 1438.9709 1480.3388 1484.0932 1549.8300 1574.5209 1586.8352 1589.6561 1613.8790 1614.5814 1639.4169 3132.3809 3132.4679 3141.8279 3141.9686 3155.0461 3155.2464 3167.5114 3167.8881 3181.5492 3183.0612 3186.2631 3188.0590
redmass: 3.5863 3.8342 7.0588 5.4014 4.5424 6.1690 5.7360 3.9197 5.5779 6.0049 7.3146 6.0738 2.7687 2.7823 7.0729 3.6489 3.8250 10.3474 5.0556 6.4778 6.4375 7.3540 3.6863 4.7039 6.9752 1.9678 1.7508 2.1104 1.7846 1.9095 6.7734 1.3317 1.3083 1.3165 1.8177 7.5576 4.7082 1.4605 1.4467 1.3952 1.3912 6.1240 6.1473 1.3340 1.3347 3.7141 3.4621 1.9222 2.5227 1.5958 1.6083 1.0552 1.0548 1.1438 1.1290 3.4618 1.4665 1.7887 2.6055 1.9285 1.5043 2.8104 7.8393 8.6448 2.3493 2.3358 2.2825 2.3273 9.8623 6.5651 5.7731 6.8218 5.9974 6.0359 7.4132 1.0852 1.0852 1.0887 1.0888 1.0940 1.0940 1.0983 1.0985 1.0966 1.0957 1.0914 1.0924
irintensity: 0.0003 0.2439 0.0115 0.1154 0.0004 8.3139 0.6131 0.0146 0.1165 0.1135 2.8361 0.9646 0.0319 0.0542 8.5249 0.1416 5.5567 0.7788 2.9443 0.7841 0.0729 9.7666 0.1425 19.6693 3.2805 39.4177 0.1228 66.8625 0.0426 111.6597 1.1865 0.0197 3.7688 0.0031 44.0136 36.0949 1.1467 0.0064 8.1891 0.0284 0.0152 2.3867 0.3891 0.0043 0.3314 7.6297 41.3130 1.8417 7.9085 6.5351 14.9096 2.1954 0.0452 23.6982 1.2875 31.9421 0.9133 5.9198 11.7220 107.3894 0.8434 248.2497 0.2214 12.3715 52.3606 3.7653 38.3885 6.4189 134.8813 65.0569 54.5480 17.2144 2.5823 0.7108 322.9148 0.7461 0.8756 7.5626 3.6221 4.0941 42.7976 50.8882 0.0647 0.0842 13.8001 11.0322 0.3782
temp: 298.150 k
press: 1.00000 atm
elementType: 8 8 6 6 6 6 6 6 6 6 6 6 6 6 6 6 6 6 6 1 1 1 1 1 1 1 1 1 1 1 1
symmnumber: 1
zpe: 622372.1 jmol-1
zpe.correction: 0.237049 hartree
zpe.thermalcorrener: 0.250221 hartree
zpe.thermalcorrenthalpy: 0.251165 hartree
zpe.thermalcorrgfe: 0.196997 hartree
zpe.sumelectzpe: -804.154778 hartree
zpe.sumelectthermal: -804.141606 hartree
zpe.sumelectthermalent: -804.140662 hartree
zpe.sumelectthermalfe: -804.194830 hartree
dipole: 0.0000 -5.5846 0.0477
dipole: 5.5849
quadrupole: -79.0835 -122.0904 -116.9508
quadrupole: 0.0004 -0.0054 0.6669
quadrupole: 26.9580 -16.0488 -10.9092 0.0004 -0.0054 0.6669
hfenergy: -804.3918269 hartree
pointgroup: C01 [X(C17H12O2)]
dipole: 0.0012314 -2.191743 -0.1554598 debye
polarizability: 287.2135625|0.020163|253.5731502|-0.0234371|15.5897075|72.8440393 unknown
InChI: InChI=1S/C17H12O2/c18-15-11-16(13-7-3-1-4-8-13)19-17(12-15)14-9-5-2-6-10-14/h1-12H
charge 0 multiplicity 1
31 atoms
O  0.000323 0.044094 0.043787
O  -0.002021 4.184546 0.340526
C  -1.223599 0.740968 0.093402
C  1.223457 0.742348 0.093489
C  -2.389989 -0.167334 0.028744
C  2.390873 -0.164644 0.028959
C  -1.236059 2.113336 0.190977
C  1.234365 2.11473 0.191082
C  -0.001298 2.908906 0.248968
C  -3.714506 0.34552 0.11735
C  3.71484 0.349828 0.116394
C  -2.210605 -1.569966 -0.123035
C  2.213045 -1.567615 -0.121508
C  -4.823723 -0.519857 0.053608
C  4.825032 -0.51431 0.052817
C  -3.323617 -2.433385 -0.186441
C  3.327029 -2.429791 -0.184763
C  -4.635422 -1.914209 -0.099009
C  4.638276 -1.909012 -0.098485
H  -2.180444 2.660528 0.22557
H  2.178132 2.662975 0.22585
H  -3.884978 1.419711 0.239455
H  3.884136 1.424333 0.237369
H  -1.197933 -1.974885 -0.191071
H  1.200807 -1.973776 -0.188571
H  -5.836081 -0.107866 0.124256
H  5.836946 -0.101073 0.122538
H  -3.167468 -3.511189 -0.304092
H  3.172073 -3.50788 -0.301372
H  -5.49989 -2.585098 -0.147919
H  5.503499 -2.578936 -0.147277
