program: Gaussian 09
title: 000283278
version: EM64L-G09RevD.01
frameworkgroup: C1[X(C19H22N6O)]
method: RPBEPBE
basis: SDD
operation: Freq
keyword: #p
keyword: freq=noraman
keyword: PBEPBE/SDD
title: #p freq=noraman PBEPBE/SDD
converged: YES YES NO NO
title: Mulliken charges:
elementType: O N N N N N N C C C C C C C C C C C C C C C C C C C H H H H H H H H H H H H H H H H H H H H H H
charge: -0.255253 -0.321405 -0.094622 -0.171484 -0.631922 -0.613209 -0.451426 0.189727 0.331030 -0.719819 -0.682321 0.225809 -0.533607 0.435105 -0.358739 -0.021220 -0.664961 -0.390873 -0.214412 0.179341 0.473888 -0.443725 -0.349506 -0.201567 -0.214798 -0.254170 0.198188 0.247499 0.231593 0.236441 0.205793 0.234614 0.281494 0.258403 0.251487 0.250821 0.248621 0.234033 0.335615 0.340428 0.317201 0.321590 0.338261 0.231171 0.307328 0.227745 0.226767 0.229049
chargesum: 0.00000
title: Mulliken charges with hydrogens summed into heavy atoms:
elementType: O N N N N N N C C C C C C C C C C C C C C C C C C C
charge: -0.255253 -0.321405 -0.094622 -0.171484 0.044121 0.025582 -0.113165 0.189727 0.331030 -0.042540 -0.005474 0.225809 -0.252113 0.435105 -0.100336 -0.021220 -0.162654 -0.142252 0.019621 0.179341 0.473888 -0.212555 -0.042178 0.026178 0.011969 -0.025121
polarizability: 3.20340779e+02 1.44241087e+01 2.75248632e+02 9.16577349e+00 -5.26126307e+00 1.90085367e+02
1716.lowfreq: 0.0003 0.0005 0.0006 1.1957 3.8937 4.8635 10.7239 17.8951 22.5171
frequency: 10.1271 17.6948 22.4482 37.0218 46.5410 68.0994 75.9952 84.3667 95.1686 124.0350 144.4025 191.4912 210.8918 223.8642 233.8153 243.8031 256.6177 265.9833 273.1526 305.1741 318.5486 326.9227 338.2856 359.0268 367.7566 380.6722 391.4472 408.2549 434.4586 439.6591 471.8696 493.1863 502.3881 508.8982 519.3253 523.9510 534.4730 551.9527 569.1785 591.4521 611.9411 617.5641 627.2821 669.2731 682.3449 689.8823 693.0194 701.5826 719.0887 725.1810 770.9068 804.3139 812.0205 833.8574 845.9250 853.6254 863.0564 908.8674 912.9906 920.3123 921.3757 926.7101 934.5493 947.8357 974.5316 983.6089 984.9746 987.4254 990.2556 998.2400 1001.1758 1026.9885 1052.9389 1088.9206 1089.2744 1105.3947 1120.1733 1130.0821 1159.0926 1172.4112 1179.8083 1180.0337 1188.2256 1191.7152 1194.3104 1244.6502 1260.4491 1275.3220 1293.9933 1300.5621 1322.8496 1363.0764 1366.1336 1380.3788 1385.0820 1402.1754 1427.7091 1430.3584 1447.5703 1449.8117 1453.6598 1459.4712 1468.6908 1474.0171 1476.7520 1485.6429 1515.1052 1533.0691 1569.7011 1582.7055 1598.7646 1601.1307 1608.0365 1614.4929 1617.9326 1622.4506 2981.2282 2988.2704 3003.5761 3074.9130 3081.4060 3089.6360 3094.1312 3108.2215 3113.4443 3128.8346 3131.9958 3132.2805 3144.6155 3146.0944 3164.5704 3165.1136 3193.9256 3484.6294 3553.2462 3567.5370 3708.1908 3729.4936
redmass: 4.5397 5.2301 4.5296 4.6813 5.1126 6.1481 4.4333 4.9871 4.1663 4.3192 4.9836 5.3986 4.2788 1.5268 2.1466 2.9889 3.7323 2.9326 1.1573 2.5594 2.8393 6.6847 2.5210 5.4251 2.9386 1.2106 1.1729 2.9243 3.8847 3.3508 3.4578 2.4489 2.4416 2.5190 3.5666 1.3917 1.5550 4.3576 3.9481 4.5849 6.1736 5.4086 5.9853 7.1043 4.8375 1.5789 3.0476 1.7530 2.2072 9.1032 1.6828 2.2511 2.3488 5.1707 1.2710 4.1702 3.1158 1.6549 2.3446 1.4366 2.1100 1.4724 2.1770 1.7938 1.3534 1.6323 5.2557 4.8398 1.3920 2.3338 1.3076 2.1370 3.1700 1.6432 1.5754 1.9292 2.1345 2.0412 1.5031 1.0528 1.9359 1.1335 1.1546 2.3212 2.6192 3.6335 2.1091 1.8950 2.3460 1.3876 1.4329 1.2394 7.2570 1.2616 6.2412 4.1543 3.0233 2.3169 3.9374 1.0620 1.1270 1.1065 1.0886 2.1215 1.1500 2.3135 2.0644 2.5381 1.8334 5.5318 5.7519 4.7143 2.4450 5.5128 2.1959 5.9308 1.0347 1.0357 1.0638 1.0974 1.1002 1.1004 1.1000 1.0986 1.0884 1.0874 1.0869 1.0919 1.0935 1.0924 1.0987 1.0998 1.0952 1.0763 1.0444 1.0437 1.1053 1.1058
irintensity: 0.0575 1.0081 1.8922 0.0783 0.1210 4.4403 1.0383 0.9315 1.5575 0.1158 1.3049 5.6989 1.8295 1.2768 1.5480 1.2670 0.4879 2.0231 0.7065 9.8530 1.1095 2.5434 2.6881 1.4264 25.7459 138.2764 248.0028 0.0698 1.4972 12.7168 17.2281 39.5385 37.5726 14.3639 1.0065 4.6245 54.6779 5.0743 4.1030 1.2698 0.2631 4.3484 0.7281 3.5987 1.4702 2.0799 10.1675 50.3410 30.9500 33.2871 88.8140 25.5270 43.1286 11.4049 0.1234 0.6168 5.3499 0.8814 2.7750 11.2301 6.9671 2.5144 9.1358 5.6850 0.3035 3.6415 0.6583 0.6617 0.3240 4.8081 2.7241 5.2832 10.4919 11.2899 19.3497 4.0551 2.1948 33.9260 32.9862 1.0572 12.3306 5.0777 2.4572 22.8423 43.4867 28.8762 30.1480 39.3821 61.8526 5.5707 27.8790 41.8629 0.8865 17.5776 39.5189 346.5315 20.3440 80.2498 152.5148 0.9418 12.8035 12.1224 13.4432 67.4963 20.4223 57.7631 292.6815 284.0501 240.2210 84.9926 280.1053 121.1387 395.8275 56.2194 442.0682 161.4440 18.5845 32.6537 11.0935 3.9211 20.7137 36.1425 12.5219 27.2887 13.2601 1.7870 1.1425 4.8125 29.6313 13.5461 11.0760 24.2641 6.8038 76.1857 58.2595 89.3768 53.6896 37.7296
temp: 298.150 k
press: 1.00000 atm
elementType: 8 7 7 7 7 7 7 6 6 6 6 6 6 6 6 6 6 6 6 6 6 6 6 6 6 6 1 1 1 1 1 1 1 1 1 1 1 1 1 1 1 1 1 1 1 1 1 1
symmnumber: 1
zpe: 1014269.3 jmol-1
zpe.correction: 0.386315 hartree
zpe.thermalcorrener: 0.410754 hartree
zpe.thermalcorrenthalpy: 0.411698 hartree
zpe.thermalcorrgfe: 0.329709 hartree
zpe.sumelectzpe: -1139.116635 hartree
zpe.sumelectthermal: -1139.092195 hartree
zpe.sumelectthermalent: -1139.091251 hartree
zpe.sumelectthermalfe: -1139.173241 hartree
dipole: -2.4771 1.7762 1.9776
dipole: 3.6334
quadrupole: -164.1583 -142.3110 -149.4466
quadrupole: -15.7369 9.2956 4.3185
quadrupole: -12.1863 9.6609 2.5254 -15.7369 9.2956 4.3185
hfenergy: -1139.5029495 hartree
pointgroup: C01 [X(C19H22N6O1)]
dipole: 1.0698731 -0.7174304 0.6197895 debye
polarizability: 315.9334805|21.3011743|274.5128894|-10.1850658|19.3854615|195.2284078 unknown
InChI: InChI=1S/C19H22N6O/c1-19(2)24-17(20)23-18(21)25(19)15-10-6-7-13(11-15)12-16(26)22-14-8-4-3-5-9-14/h3-11,22H,12,20-21H2,1-2H3
charge 0 multiplicity 1
48 atoms
O  -3.820123 -2.244449 -1.835991
N  2.5956 0.09653 0.014125
N  3.014337 2.540189 -0.044499
N  4.568301 0.94186 -1.075783
N  4.097608 -1.340776 -1.138515
N  4.770653 3.237092 -1.433542
N  -2.671473 -0.678018 -0.510586
C  2.416822 1.45268 0.741506
C  1.665827 -0.987255 0.20204
C  0.912166 1.749184 0.900853
C  3.113118 1.362217 2.128374
C  3.762926 -0.067524 -0.72333
C  0.663855 -1.224809 -0.775224
C  -0.285328 -2.265335 -0.61562
C  1.735266 -1.822082 1.347176
C  4.064927 2.231969 -0.79689
C  -1.389382 -2.479364 -1.636215
C  -0.207624 -3.084876 0.543325
C  0.796141 -2.866524 1.511526
C  -2.750448 -1.798254 -1.326522
C  -3.715944 0.195374 -0.086721
C  -3.346747 1.302681 0.724854
C  -5.078624 0.000233 -0.437655
C  -4.327235 2.204591 1.183321
C  -6.04779 0.9141 0.030634
C  -5.68655 2.015859 0.839275
H  0.406426 0.99786 1.534012
H  0.816455 2.739758 1.374405
H  0.426705 1.798905 -0.089236
H  3.049444 2.345244 2.626418
H  2.630809 0.607662 2.776791
H  4.180695 1.108082 2.003028
H  0.640591 -0.583186 -1.664404
H  2.519232 -1.65149 2.092322
H  -1.076995 -2.111028 -2.632446
H  -1.623817 -3.550885 -1.755938
H  -0.935104 -3.893407 0.681253
H  0.850337 -3.51095 2.395788
H  4.914258 -1.426801 -1.738043
H  3.587203 -2.162784 -0.82785
H  4.495276 4.204095 -1.290475
H  5.516831 2.982347 -2.073166
H  -1.736442 -0.456009 -0.153717
H  -2.293355 1.458283 0.99266
H  -5.354057 -0.850544 -1.063206
H  -4.028878 3.05468 1.806662
H  -7.097612 0.759103 -0.242843
H  -6.448979 2.716973 1.194873
