program: Gaussian 09
title: 000283290
version: EM64L-G09RevD.01
frameworkgroup: C1[X(C22H25NO3)]
method: RPBEPBE
basis: SDD
operation: Freq
keyword: #p
keyword: freq=noraman
keyword: PBEPBE/SDD
title: #p freq=noraman PBEPBE/SDD
converged: YES YES NO NO
title: Mulliken charges:
elementType: O O O N C C C C C C C C C C C C C C C C C C C C C C H H H H H H H H H H H H H H H H H H H H H H H H H
charge: -0.294439 -0.290098 -0.261549 -0.221138 0.411647 -0.475012 -0.476835 -0.422624 -0.433569 -0.391420 -0.408519 -0.672749 0.169030 0.233880 0.209563 -0.373208 -0.344703 0.217339 -0.225915 -0.236980 -0.230315 -0.343724 -0.336087 -0.220339 -0.222843 -0.222080 0.197401 0.278209 0.222232 0.197276 0.206765 0.201291 0.249486 0.195921 0.206126 0.185651 0.251566 0.283255 0.226082 0.263498 0.258967 0.265238 0.246138 0.230233 0.229203 0.230763 0.270881 0.266885 0.234155 0.232256 0.233207
chargesum: 0.00000
title: Mulliken charges with hydrogens summed into heavy atoms:
elementType: O O O N C C C C C C C C C C C C C C C C C C C C C C
charge: -0.294439 -0.290098 -0.261549 -0.221138 0.411647 0.000597 -0.057328 -0.014568 0.011838 0.000358 0.126303 0.075798 0.169030 0.233880 0.209563 -0.107970 -0.098565 0.217339 0.004318 -0.007777 0.000449 -0.072843 -0.069201 0.013816 0.009413 0.011127
polarizability: 2.99448983e+02 -2.15008676e+01 2.71474178e+02 -4.80328175e+00 -5.89158026e+00 1.83380390e+02
1716.lowfreq: -5.8218 -2.3795 -0.0007 -0.0003 0.0001 4.0994 16.5708 20.9073 31.6962
frequency: 16.4674 20.8809 31.6080 49.1621 52.0385 65.5506 76.4938 111.4882 116.1733 131.9241 146.0824 160.8364 174.6380 187.0928 211.5871 237.9054 249.6288 268.1273 285.0224 303.1779 329.4704 344.3391 361.9113 376.9320 382.8269 404.4932 407.2699 418.5334 438.1069 452.1128 471.2471 481.9547 509.9166 552.4152 590.9038 613.9151 614.1932 625.6990 655.1423 675.0887 686.5138 701.1616 704.1987 710.9722 747.5873 775.3501 788.3218 793.6169 794.0581 828.9428 852.3560 860.2119 865.2391 875.2141 900.9682 922.1950 936.0713 937.7001 954.9692 973.8958 983.4117 984.1188 990.0871 990.3672 996.6735 1000.4090 1008.6713 1016.6876 1020.1442 1042.8523 1050.1121 1057.4911 1076.3654 1082.5564 1086.2359 1096.9504 1107.1840 1110.9861 1137.7852 1148.5945 1170.8119 1172.7166 1173.8423 1179.9899 1182.6409 1188.1642 1223.8040 1241.8994 1254.2601 1265.6972 1276.6583 1303.3701 1313.6807 1315.3280 1319.3429 1339.2758 1342.4806 1349.8003 1351.8104 1362.1752 1367.9673 1380.3725 1389.5060 1431.9940 1437.7669 1440.2419 1457.5877 1466.0654 1468.5766 1477.1215 1477.7505 1479.1605 1482.0324 1487.1735 1496.0701 1497.4631 1543.1231 1583.4196 1589.4073 1608.3014 1610.4681 1618.0321 2964.9023 2977.4633 2979.9774 2986.4181 2988.9215 2992.8593 3029.7864 3036.4389 3044.6425 3050.6453 3054.9048 3071.2993 3085.1485 3124.4725 3124.8694 3127.9981 3130.3282 3133.3795 3142.5397 3145.1018 3155.3417 3156.1953 3166.7756 3167.9450 3176.6528
redmass: 5.3800 4.8711 4.7046 3.9874 4.5728 5.5280 5.1688 4.7548 4.3907 3.2331 3.6570 4.0092 1.9675 4.0082 4.2888 1.7903 3.0369 4.2680 3.0932 4.0326 3.2690 3.2422 2.7901 2.7273 3.8405 2.8319 2.8228 3.6717 3.7714 3.6502 2.6122 3.5710 2.3606 4.6002 2.8017 6.3921 6.4338 6.5996 6.1672 4.9486 4.2784 1.6699 2.7819 1.9922 4.5191 5.0666 1.4875 2.3251 2.1331 2.1970 2.0229 1.2470 1.2443 2.5896 3.7744 2.8152 1.4781 1.4426 1.4189 1.9899 1.4181 2.2684 5.5354 5.9008 1.3971 1.3278 1.3296 2.8539 2.8292 1.9225 2.7449 2.0948 1.8113 1.6145 1.6939 1.5314 1.5767 1.4543 2.0896 2.6116 2.1317 1.0650 1.0566 1.2199 1.5743 1.3052 1.9991 3.6815 1.3033 1.2727 1.2912 1.5514 1.3239 1.3248 1.3690 1.5174 1.5710 1.7624 1.8543 1.3577 1.4532 8.7681 10.0914 2.1781 2.2383 1.2310 1.0850 1.1365 1.0901 1.8937 2.0083 1.1586 1.1211 1.0826 1.0896 1.0824 6.6707 6.7271 6.2385 6.0355 6.2075 8.9473 1.0634 1.0608 1.0626 1.0658 1.0624 1.0398 1.0953 1.1006 1.0956 1.0633 1.0978 1.1018 1.0949 1.0857 1.1079 1.0959 1.0855 1.0881 1.0891 1.0929 1.0937 1.0961 1.0973 1.1010 1.0985
irintensity: 0.2202 0.4242 0.5995 0.5394 1.5635 2.6571 0.6566 0.4925 3.6944 0.7282 0.3214 1.1807 1.4229 2.1560 5.9687 1.1881 0.7725 0.2481 1.9430 14.8965 4.0524 10.7031 3.7000 3.5083 1.0160 0.0226 0.2393 5.8254 0.9563 0.4092 2.2526 13.4703 1.4926 2.9946 14.0069 0.5086 0.6222 14.6595 5.2400 15.8754 2.8259 70.0975 23.7932 94.1246 1.2463 14.5261 2.6227 28.2114 20.7598 2.4609 9.9190 1.4162 0.3471 5.4842 29.2511 1.1200 2.0080 4.9424 3.6569 1.5706 2.7625 17.3843 0.5401 1.0470 0.5525 0.2652 0.4139 124.9727 60.1484 42.9611 225.0021 19.8447 30.3950 7.2383 19.2878 9.5219 2.7326 8.0450 5.6073 13.0150 22.2321 0.1306 0.1303 56.6782 12.4319 0.0274 45.5402 326.0553 12.3307 15.7924 8.9942 5.8238 1.1645 0.9750 1.3532 45.0042 82.1415 71.5269 44.2162 28.3304 26.1386 0.7904 2.6882 7.5073 16.1354 7.6645 8.6431 45.8063 14.6926 3.0001 3.2541 4.3560 22.0669 3.7760 22.3213 19.6981 161.9028 41.0602 6.5666 2.6020 11.3434 142.0866 40.5190 16.7806 25.7800 28.3984 18.4806 53.8234 74.5759 51.6890 22.3051 16.3450 48.9141 32.7492 11.0412 4.5688 8.5832 11.7506 0.1552 2.7998 10.2131 22.5493 15.6546 23.0605 23.1176 20.5331 9.2551
temp: 298.150 k
press: 1.00000 atm
elementType: 8 8 8 7 6 6 6 6 6 6 6 6 6 6 6 6 6 6 6 6 6 6 6 6 6 6 1 1 1 1 1 1 1 1 1 1 1 1 1 1 1 1 1 1 1 1 1 1 1 1 1
symmnumber: 1
zpe: 1108531.2 jmol-1
zpe.correction: 0.422217 hartree
zpe.thermalcorrener: 0.445811 hartree
zpe.thermalcorrenthalpy: 0.446755 hartree
zpe.thermalcorrgfe: 0.367256 hartree
zpe.sumelectzpe: -1131.875803 hartree
zpe.sumelectthermal: -1131.852209 hartree
zpe.sumelectthermalent: -1131.851265 hartree
zpe.sumelectthermalfe: -1131.930764 hartree
dipole: 0.0331 -2.4678 3.8656
dipole: 4.5862
quadrupole: -145.2797 -139.9746 -155.7480
quadrupole: 2.6814 4.1858 2.5174
quadrupole: 1.7211 7.0261 -8.7472 2.6814 4.1858 2.5174
hfenergy: -1132.2980205 hartree
pointgroup: C01 [X(C22H25N1O3)]
dipole: -0.0600497 0.8419117 -1.5947761 debye
polarizability: 288.4568865|26.4880854|280.0013852|12.2245623|-9.6874453|185.8452791 unknown
InChI: InChI=1S/C22H25NO3/c1-23(20(24)18-11-5-2-6-12-18)22(15-9-4-10-16-22)17-26-21(25)19-13-7-3-8-14-19/h2-3,5-8,11-14H,4,9-10,15-17H2,1H3
charge 0 multiplicity 1
51 atoms
O  -1.40604 -0.415021 0.513541
O  2.199025 -0.052414 1.884054
O  -3.072981 -2.051631 0.633155
N  1.42763 -0.348186 -0.318482
C  0.715668 -1.651082 0.033148
C  1.751066 -2.653436 0.645988
C  0.131725 -2.288731 -1.264129
C  1.193612 -4.083281 0.850163
C  -0.449496 -3.707359 -1.043675
C  0.605212 -4.667058 -0.452353
C  -0.395206 -1.357484 1.077052
C  0.97495 0.39386 -1.522218
C  2.201292 0.294506 0.653726
C  3.117062 1.418816 0.222997
C  -2.716886 -0.877108 0.358681
C  3.276173 2.519576 1.102495
C  3.916573 1.344974 -0.947362
C  -3.622703 0.186108 -0.168703
C  4.192578 3.54874 0.799925
C  4.848307 2.365117 -1.240014
C  4.98122 3.474907 -0.372892
C  -4.969162 -0.16658 -0.447211
C  -3.179497 1.516452 -0.390179
C  -5.863463 0.801495 -0.947416
C  -4.078974 2.482208 -0.889158
C  -5.420106 2.127299 -1.170252
H  2.606401 -2.697144 -0.058472
H  2.136207 -2.256325 1.598404
H  -0.651978 -1.641834 -1.697534
H  0.950396 -2.35733 -2.008434
H  0.415306 -4.083773 1.639574
H  2.012676 -4.726538 1.225685
H  -1.332199 -3.656057 -0.378222
H  -0.814914 -4.089961 -2.016359
H  0.156879 -5.661161 -0.262871
H  1.422381 -4.815172 -1.188928
H  -0.912896 -2.279378 1.386443
H  0.043322 -0.841361 1.944108
H  1.250727 -0.1210 -2.458688
H  -0.121676 0.520122 -1.493066
H  1.432149 1.392723 -1.529876
H  2.688649 2.541964 2.026161
H  3.825798 0.478151 -1.611927
H  4.300815 4.400534 1.480387
H  5.472644 2.291812 -2.137448
H  5.700506 4.268896 -0.603098
H  -5.289535 -1.197365 -0.263177
H  -2.144069 1.780543 -0.157147
H  -6.901934 0.52714 -1.161885
H  -3.738309 3.509843 -1.055854
H  -6.116128 2.879885 -1.557561
