program: Gaussian 09
title: 000283163
version: EM64L-G09RevD.01
frameworkgroup: C1[X(C7H7N3OS)]
method: RPBEPBE
basis: SDD
operation: Freq
keyword: #p
keyword: freq=noraman
keyword: PBEPBE/SDD
title: #p freq=noraman PBEPBE/SDD
converged: NO NO NO NO
title: Mulliken charges:
elementType: S O N N N C C C C C C C H H H H H H H
charge: 0.273226 -0.215407 -0.046264 0.009193 0.016474 0.145484 0.118151 0.226343 -0.402834 -0.754185 -0.391328 -0.821134 0.262838 0.254994 0.255005 0.255837 0.284012 0.284462 0.245135
chargesum: 0.00000
title: Mulliken charges with hydrogens summed into heavy atoms:
elementType: S O N N N C C C C C C C
charge: 0.273226 -0.215407 -0.046264 0.009193 0.016474 0.145484 0.118151 0.226343 -0.402834 0.018652 -0.135492 -0.007526
polarizability: 1.77617004e+02 2.72874753e-01 1.25658062e+02 1.54882628e-02 1.67523818e-02 5.45092885e+01
1716.lowfreq: -4.8980 0.0004 0.0016 0.0024 8.2323 12.3372 66.5506 94.3412 111.6013
frequency: 66.5483 94.3405 111.5915 132.7380 135.8210 145.1242 228.5272 268.0596 298.6724 322.0092 398.1964 515.1108 532.2528 537.7454 619.7797 621.4862 640.3406 656.6620 713.6067 789.2499 789.5146 829.9698 923.3318 924.6966 980.0259 993.2509 996.2521 1047.5640 1120.1599 1135.3019 1195.5318 1252.0078 1277.9444 1316.6672 1346.9028 1387.0682 1400.1815 1434.7129 1448.6616 1451.5173 1455.0784 1511.8829 1529.2110 1583.6761 3002.6821 3026.5687 3083.3141 3136.4592 3151.2863 3160.3620 3179.4566
redmass: 3.3396 1.0983 1.2128 3.8448 4.4463 3.7429 3.4821 10.9633 3.7958 4.5405 10.9074 6.1954 6.4185 4.7948 8.2559 8.8010 6.0258 7.4311 7.7934 8.0681 11.2362 12.9289 1.4397 8.9638 1.1797 1.4174 1.9047 1.4956 7.6509 4.2753 5.2863 5.7893 8.3123 8.9093 1.1346 1.3833 1.2499 1.0521 1.0549 1.0435 1.1114 8.3576 10.4267 8.7220 1.0378 1.0283 1.0976 1.0991 1.1042 1.1057 1.0925
irintensity: 4.3602 0.1060 0.0001 0.8387 4.0679 0.3221 1.4373 0.2663 2.7941 1.6414 3.1246 4.2125 2.8608 7.3495 0.3426 0.2892 6.8747 2.1332 33.6538 31.2814 1.2674 21.5927 12.4342 105.0642 6.5829 6.2737 2.5414 5.9047 0.6100 83.6859 15.8280 3.9843 79.1672 111.6644 2.3898 33.5143 9.8099 14.8541 24.3092 19.4682 15.8120 74.8268 106.1593 200.1483 5.6271 19.3434 6.1417 2.9386 6.5931 8.7699 10.5871
temp: 298.150 k
press: 1.00000 atm
elementType: 16 8 7 7 7 6 6 6 6 6 6 6 1 1 1 1 1 1 1
symmnumber: 1
zpe: 352294.9 jmol-1
zpe.correction: 0.134182 hartree
zpe.thermalcorrener: 0.145298 hartree
zpe.thermalcorrenthalpy: 0.146242 hartree
zpe.thermalcorrgfe: 0.096519 hartree
zpe.sumelectzpe: -907.602658 hartree
zpe.sumelectthermal: -907.591542 hartree
zpe.sumelectthermalent: -907.590598 hartree
zpe.sumelectthermalfe: -907.640321 hartree
dipole: 0.0723 -1.2263 0.0064
dipole: 1.2284
quadrupole: -59.1334 -83.5929 -76.8023
quadrupole: 7.6549 0.0117 -0.0112
quadrupole: 14.0428 -10.4167 -3.6261 7.6549 0.0117 -0.0112
hfenergy: -907.7368399 hartree
pointgroup: C01 [X(C7H7N3O1S1)]
dipole: -0.0175948 -0.4827324 0.0154666 debye
dipolederiv: -0.3311675 0.2931747 -0.0215657 0.6144643 -0.3633028 0.038031 -0.0291603 0.0222875 -0.0544648 -0.8455973 -0.2486396 -0.0264109 -0.1666257 -0.6777463 0.0077811 -0.0283963 0.0040093 -0.1298436 -0.7605057 -0.0519703 -0.0236316 0.0174918 -0.3544306 0.004492 -0.0249074 0.0012978 -0.2235705 -0.6451805 -0.0822327 -0.0188298 0.0320587 -0.6136644 0.0135993 -0.0218673 0.0079944 -0.1947363 -0.4036752 -0.0477009 -0.0105168 0.4040603 -1.0704478 0.0452149 -0.0228468 0.0233769 -0.1517639 -0.3250628 0.429365 -0.0326553 0.5945018 -0.1983704 0.0366917 -0.0381384 0.0290123 0.1100317 0.8490116 0.2882076 0.0238321 -0.3089352 0.5100155 -0.0242931 0.0404308 0.0039513 0.165717 0.9413621 0.1002944 0.0372995 0.1227 0.8109808 -0.0153083 0.0366108 -0.0162923 0.0734833 0.8073568 -0.532197 0.0535566 -0.9510736 1.0963718 -0.0765146 0.0650925 -0.0566287 -0.0078321 -0.3056493 -0.1130364 -0.0129871 0.007472 -0.0099497 0.0019084 -0.0165261 -0.0037201 0.0437134 0.5909449 -0.0542151 0.031495 -0.1582642 0.6615388 -0.0275287 0.034373 -0.022644 -0.0458624 0.247429 -0.0089558 0.0105771 -0.0190035 0.0224308 0.0005403 0.0102505 0.0016391 0.0510007 0.0907927 0.0447977 -0.0033713 -0.0282699 -0.0491507 0.003954 -0.0013223 0.0073268 0.1363124 0.0170748 -0.002973 0.0541608 -0.010687 0.0852289 -0.0762212 0.0979042 -0.0490384 0.0071207 0.0307542 -0.0102511 -0.0513318 -0.022909 0.0919791 0.0694325 -0.094441 0.043223 -0.0133795 0.0485366 -0.0675009 -0.0021278 -0.0446303 -0.0311817 0.0025986 -0.0028557 0.001516 0.134202 0.0038984 -0.0066125 -0.0129921 -0.0935301 0.0540612 -0.0985314 -0.0095016 -0.0667428 -0.0119088 0.0031288 -0.0125811 0.0142334 -0.1018034 0.0615286 0.0856668 0.0150723 0.0621151 -0.0155131 -0.0134516 0.0830273 -0.0087343 0.112983 -0.0258909 0.0084869 -0.0097709 0.007317 0.1272938 unknown
polarizability: 176.9281154|-4.4737632|126.0055072|5.8981651|-2.2368216|54.850732 unknown
InChI: InChI=1S/C7H7N3OS/c1-4-10-5-6(11-4)8-3-9-7(5)12-2/h3H,1-2H3
charge 0 multiplicity 1
19 atoms
S  2.173542 -1.871575 0.26026
O  -2.196193 0.716768 -0.017067
N  -1.152116 -1.361804 0.089774
N  -0.210791 2.141566 0.035217
N  1.889459 0.876189 0.169303
C  -0.177252 -0.335044 0.105996
C  -0.808227 0.935376 0.041109
C  -2.314082 -0.729899 0.018587
C  1.238606 -0.327352 0.172405
C  -3.696671 -1.274751 -0.029595
C  1.154032 2.027646 0.102421
C  3.925849 -1.187235 0.327885
H  -3.652279 -2.373072 0.003589
H  -4.293105 -0.907101 0.824059
H  -4.211308 -0.957459 -0.953755
H  1.718884 2.963358 0.102507
H  4.04477 -0.557543 1.21999
H  4.129156 -0.595863 -0.575097
H  4.578922 -2.072504 0.377611
