program: Gaussian 09
title: 000283167
version: EM64L-G09RevD.01
frameworkgroup: C1[X(C13H11N3OS)]
method: RPBEPBE
basis: SDD
operation: Freq
keyword: #p
keyword: freq=noraman
keyword: PBEPBE/SDD
title: #p freq=noraman PBEPBE/SDD
converged: NO YES NO YES
title: Mulliken charges:
elementType: S O N N N C C C C C C C C C C C C C H H H H H H H H H H H
charge: 0.273894 -0.213861 -0.046718 0.013671 0.008455 0.140708 -0.797894 0.474056 -0.403553 0.116454 0.227990 -0.375562 -0.375553 -0.755680 -0.220234 -0.220233 -0.234308 -0.392597 0.293502 0.293505 0.238108 0.238106 0.254491 0.263274 0.254490 0.229050 0.229050 0.256170 0.231219
chargesum: 0.00000
title: Mulliken charges with hydrogens summed into heavy atoms:
elementType: S O N N N C C C C C C C C C C C C C
charge: 0.273894 -0.213861 -0.046718 0.013671 0.008455 0.140708 -0.210887 0.474056 -0.403553 0.116454 0.227990 -0.137455 -0.137448 0.016575 0.008817 0.008817 -0.003089 -0.136427
polarizability: 2.95934827e+02 -7.98638025e+00 1.60926957e+02 -1.68850449e-02 -9.51909382e-03 1.19446374e+02
1716.lowfreq: -1.1947 -0.0013 0.0015 0.0024 7.2787 8.9044 14.7246 26.0734 46.4847
frequency: 14.3943 25.4334 46.4839 61.6876 98.3161 120.9824 129.2349 142.1617 155.9281 242.1987 267.2113 301.3756 321.1542 323.4865 402.4024 407.1061 471.0907 515.1983 525.6219 536.7253 559.4326 617.0513 618.4311 622.5724 640.3967 645.2338 702.0021 714.2640 775.6838 788.3333 799.4009 810.2774 832.8897 852.5530 883.1712 922.8470 923.5905 928.2567 978.3288 989.9916 996.5626 997.6678 1026.8079 1047.4641 1074.6726 1117.4438 1123.3548 1138.3021 1173.7134 1188.1509 1196.0718 1219.5243 1246.0287 1252.1558 1276.3426 1314.9687 1325.5440 1385.1778 1386.1477 1401.0367 1440.8645 1441.8121 1452.8052 1454.8480 1484.5007 1508.5303 1529.0432 1580.2894 1593.7954 1614.5797 3001.3471 3055.5408 3081.5113 3123.2643 3124.9494 3132.4712 3134.1205 3137.6975 3149.9511 3166.1519 3178.9781
redmass: 5.5803 4.1401 5.8024 4.5276 1.1220 6.2303 7.8995 3.7900 6.0324 4.6577 10.9154 3.8338 4.5311 2.2352 2.8001 13.5872 4.0352 6.5513 5.9192 4.8669 6.2223 6.3323 8.0603 8.8006 6.0177 4.8696 1.6814 7.2434 2.1542 11.2808 7.4379 4.0795 12.6852 1.2512 1.5332 5.7653 1.4580 1.6045 1.3913 6.1140 2.1390 1.3266 2.1917 1.4975 1.4888 8.3990 1.0827 4.4706 1.0524 1.1201 4.5610 2.1119 1.7620 3.6868 8.0542 8.6871 1.2786 8.7992 1.3778 1.2502 2.2083 1.1166 1.0435 1.1190 2.3607 8.1432 10.5448 8.5878 6.1033 6.1471 1.0379 1.0581 1.0975 1.0852 1.0891 1.1076 1.0990 1.0920 1.0964 1.1017 1.0925
irintensity: 0.0249 0.1542 0.4455 1.7563 0.2360 1.7975 0.7886 0.6864 1.4118 2.7810 0.1298 2.9491 1.2736 1.0294 0.0010 4.1804 5.2354 3.5189 1.1976 6.7380 35.6659 0.1732 0.3714 0.2398 6.4350 27.9485 55.6056 46.6470 22.5761 0.8986 37.7805 7.0993 26.7571 0.0130 0.3318 124.7949 14.1828 6.5531 0.0113 0.6245 4.5852 0.0685 7.1668 5.6819 8.5051 0.9767 1.7904 95.0533 0.0253 3.6167 33.0139 1.2857 24.2394 9.7940 102.3305 139.5313 0.2425 0.1767 47.1853 10.0634 8.7664 7.8262 19.0721 14.5465 13.0168 90.6589 141.5824 228.3163 1.0130 1.4642 6.6580 5.5230 6.2526 6.3711 0.6780 2.5132 2.9367 14.6936 38.3425 24.8525 11.7065
temp: 298.150 k
press: 1.00000 atm
elementType: 16 8 7 7 7 6 6 6 6 6 6 6 6 6 6 6 6 6 1 1 1 1 1 1 1 1 1 1 1
symmnumber: 1
zpe: 562167.6 jmol-1
zpe.correction: 0.214118 hartree
zpe.thermalcorrener: 0.229745 hartree
zpe.thermalcorrenthalpy: 0.230689 hartree
zpe.thermalcorrgfe: 0.167897 hartree
zpe.sumelectzpe: -1138.247195 hartree
zpe.sumelectthermal: -1138.231569 hartree
zpe.sumelectthermalent: -1138.230625 hartree
zpe.sumelectthermalfe: -1138.293416 hartree
dipole: 0.9898 -1.3420 0.0010
dipole: 1.6675
quadrupole: -96.8916 -112.5113 -105.2467
quadrupole: 11.9638 0.0018 0.0021
quadrupole: 7.9916 -7.6281 -0.3635 11.9638 0.0018 0.0021
hfenergy: -1138.4613138 hartree
pointgroup: C01 [X(C13H11N3O1S1)]
dipole: -0.3988778 0.520876 0.000402 debye
polarizability: 296.1791955|-5.5435496|160.6825894|0.0167104|0.0098225|119.4463739 unknown
InChI: InChI=1S/C13H11N3OS/c1-9-16-11-12(17-9)14-8-15-13(11)18-7-10-5-3-2-4-6-10/h2-6,8H,7H2,1H3
charge 0 multiplicity 1
29 atoms
S  -0.525921 0.5364 -0.000468
O  4.547558 0.183887 0.001081
N  2.679653 1.572975 -0.000431
N  0.962174 -1.792275 -0.000335
N  3.410266 -1.980733 0.000338
C  2.266782 0.218568 -0.000252
C  -1.81444 -0.897217 -0.000372
C  -3.200328 -0.303489 -0.000142
C  1.002243 -0.423279 -0.000217
C  3.401934 -0.635632 0.000249
C  4.004663 1.52401 0.000051
C  -3.864766 -0.021189 -1.222074
C  -3.864366 -0.021208 1.222011
C  4.993341 2.633742 -0.000006
C  -5.166049 0.527416 -1.2231
C  -5.165648 0.527398 1.223472
C  -5.820317 0.803054 0.000295
C  2.13756 -2.491544 -0.001207
H  -1.597405 -1.499305 0.894233
H  -1.597661 -1.499195 -0.895111
H  -3.358817 -0.232549 -2.171807
H  -3.358108 -0.232586 2.171575
H  5.645431 2.580764 -0.889859
H  4.456611 3.593785 -0.000636
H  5.644686 2.581511 0.890435
H  -5.668911 0.737825 -2.173463
H  -5.668199 0.737792 2.174002
H  2.053048 -3.581301 0.001476
H  -6.830614 1.227075 0.000464
