program: Gaussian 09
title: 000283161
version: EM64L-G09RevD.01
frameworkgroup: C1[X(C7H7N3O2)]
method: RPBEPBE
basis: SDD
operation: Freq
keyword: #pfreq=noraman
keyword: PBEPBE/SDD
title: #p freq=noraman PBEPBE/SDD
converged: YES YES NO NO
title: Mulliken charges:
elementType: O O N N N C C C C C C C H H H H H H H
charge: -0.217225 -0.218897 -0.021101 -0.361453 0.005536 0.204921 -0.471799 -0.058148 0.100453 0.136629 -0.670364 -0.215884 0.234201 0.249721 0.230200 0.229164 0.237563 0.348967 0.257514
chargesum: 0.00000
title: Mulliken charges with hydrogens summed into heavy atoms:
elementType: O O N N N C C C C C C C
charge: -0.217225 -0.218897 -0.021101 -0.012486 0.005536 0.204921 0.012123 -0.058148 0.100453 0.136629 0.026564 0.041630
polarizability: 1.49794661e+02 7.79344713e-01 1.03302175e+02 -5.68320880e+00 3.15856173e-01 5.27676951e+01
1716.lowfreq: -7.1971 -5.6609 -2.0449 0.0006 0.0007 0.0009 38.8944 90.4843 149.3442
frequency: 38.8457 90.4821 149.3439 176.5712 205.2498 248.6036 255.3416 341.6814 408.9870 466.8196 533.4377 549.3776 570.0501 604.9873 640.5452 687.4817 737.6848 751.3987 773.8946 776.8825 826.7597 851.8311 896.8259 949.2496 989.7311 1052.4723 1070.5022 1095.3012 1137.9622 1165.5366 1253.6643 1292.5036 1316.6440 1334.7794 1368.0675 1391.4597 1414.0611 1454.5628 1475.6003 1484.9331 1502.8711 1531.3267 1555.2784 1694.3701 2996.2286 3005.8382 3078.8212 3097.2204 3107.0271 3169.6227 3504.8113
redmass: 2.7782 3.6516 10.2774 1.6833 2.8785 2.3138 5.7424 3.9218 5.0143 6.7047 6.7951 4.6960 5.5011 7.0256 4.1415 6.6710 6.0981 1.7183 1.7582 4.3009 3.2831 8.9727 1.4027 2.5605 5.4122 2.6365 1.7668 3.7905 3.0798 2.9979 1.4507 2.3220 1.5505 2.6385 2.1415 1.2082 2.6617 1.0835 1.0441 1.0716 8.5683 4.6932 7.8471 8.5283 1.0348 1.0639 1.0977 1.1008 1.1011 1.0940 1.0784
irintensity: 0.1680 5.4415 5.7551 1.9183 2.5505 2.2331 1.0994 2.0518 1.3122 1.1661 4.2496 10.9054 6.1881 7.4853 11.4451 6.2328 3.4366 65.7561 12.7169 42.2299 28.8468 1.1652 4.8986 43.3194 32.0841 15.3272 17.7682 2.7558 38.4335 62.6970 14.7769 11.7491 5.5079 44.6729 3.2507 7.9394 4.7242 11.6344 14.2146 6.4313 20.1865 69.4285 112.9316 511.4337 29.8143 13.3188 0.4702 35.3564 26.5717 2.9952 57.8489
temp: 298.150 k
press: 1.00000 atm
elementType: 8 8 7 7 7 6 6 6 6 6 6 6 1 1 1 1 1 1 1
symmnumber: 1
zpe: 365300.8 jmol-1
zpe.correction: 0.139136 hartree
zpe.thermalcorrener: 0.149107 hartree
zpe.thermalcorrenthalpy: 0.150051 hartree
zpe.thermalcorrgfe: 0.102901 hartree
zpe.sumelectzpe: -584.779902 hartree
zpe.sumelectthermal: -584.769931 hartree
zpe.sumelectthermalent: -584.768987 hartree
zpe.sumelectthermalfe: -584.816137 hartree
dipole: -0.2365 -2.7971 0.1556
dipole: 2.8114
quadrupole: -45.8417 -86.3147 -68.4321
quadrupole: 11.1556 -1.5955 -1.0933
quadrupole: 21.0212 -19.4519 -1.5693 11.1556 -1.5955 -1.0933
hfenergy: -584.9190379 hartree
pointgroup: C01 [X(C7H7N3O2)]
dipole: -0.1290922 -1.0601578 0.2877498 debye
dipolederiv: -0.824829 -0.0772332 0.0668085 -0.0386815 -0.5047465 0.0706401 0.0768384 0.0772447 -0.1197157 -0.5751604 0.3536824 -0.0543842 0.4226014 -1.1627657 0.1328307 -0.0599946 0.1252749 -0.3636598 -0.6445325 -0.0483009 0.0173342 0.1673822 -0.3242148 0.024525 0.011324 0.0269513 -0.2197344 -0.3371783 -0.265143 0.0559929 0.4806477 -0.8299279 0.072726 -0.0847845 0.1328507 -0.2811736 -0.8506245 -0.1438511 0.0769899 0.0380297 -0.4658608 0.0418853 0.0474836 0.0576132 -0.2372554 0.9116561 0.0558319 -0.0292731 -0.0084302 0.554837 -0.0865091 -0.0980357 -0.0935144 0.0364171 -0.1198173 -0.0060209 -0.0243346 0.1126315 0.0827589 0.0327753 -0.1162174 0.0319582 0.0684896 -0.0693805 0.4605371 -0.0951421 0.2931084 -0.3339463 0.0419489 -0.0452224 0.0260921 0.024485 0.8355892 0.1701811 -0.0953808 -0.1989298 0.5044629 -0.048218 -0.0249263 -0.0804805 0.1584915 0.7594982 -0.3014371 0.022666 -0.5096808 1.7232558 -0.2593764 0.0531 -0.2584733 0.2788377 -0.0081536 0.0007024 -0.0118941 -0.0563358 0.0652743 0.0180754 0.1317657 0.022094 0.0294089 0.6760182 -0.1496669 -0.0315685 -0.6659185 0.4707575 -0.0360534 0.0671551 -0.0749573 0.0261396 -0.0110227 0.0135651 0.0187837 0.029008 0.0332104 -0.1170281 0.0342426 -0.0789375 -0.0288988 0.0508519 0.0041331 -0.0118463 -0.0454576 -0.0480619 0.0816894 -0.0107487 0.0548746 0.0685263 0.09906 0.0611249 0.0459077 0.0323819 -0.0058606 -0.1158248 -0.0006383 -0.0838277 -0.0498307 -0.228468 -0.0060509 0.0036898 0.0037718 0.1110875 0.010641 -0.0083237 0.0093859 0.0692218 0.1119024 -0.0690428 0.0101351 -0.0316475 -0.0865722 0.0785867 -0.0028609 0.0457932 0.0523879 0.2320055 -0.0049543 0.0120621 0.0228181 0.1626157 0.0321677 0.0052262 0.0351608 0.3365171 -0.0074148 -0.0480568 0.0234539 -0.0472991 0.0536966 0.0245182 0.0246169 0.0248971 0.151346 unknown
polarizability: 149.9669451|-1.5243043|101.2672649|-3.7185496|-9.9575026|54.630321 unknown
InChI: InChI=1S/C7H7N3O2/c1-2-4-10-5-6(11)8-3-9-7(5)12-4/h3,8H,2H2,1H3
charge 0 multiplicity 1
19 atoms
O  1.132953 -1.08238 -0.018915
O  -2.214965 2.251558 -0.354811
N  0.792708 1.176325 -0.418558
N  -2.734814 0.001534 0.122695
N  -1.166464 -1.804975 0.32732
C  1.701232 0.214583 -0.318889
C  3.185667 0.279275 -0.447764
C  -0.445216 0.539885 -0.18506
C  -0.242719 -0.831523 0.059019
C  -1.794652 1.082446 -0.168416
C  3.920521 -0.060893 0.876729
C  -2.412141 -1.325006 0.346904
H  3.512912 -0.421114 -1.239537
H  3.435217 1.301023 -0.779561
H  3.644587 0.650969 1.673915
H  5.01249 -0.004311 0.725834
H  3.668836 -1.079821 1.216904
H  -3.71693 0.297057 0.153981
H  -3.239023 -2.010732 0.55211
