program: Gaussian 09
title: 000283160
version: EM64L-G09RevD.01
frameworkgroup: C1[X(C11H8N4O)]
method: RPBEPBE
basis: SDD
operation: Freq
keyword: #p
keyword: freq=noraman
keyword: PBEPBE/SDD
title: #p freq=noraman PBEPBE/SDD
converged: NO NO NO NO
title: Mulliken charges:
elementType: O N N N N C C C C C C C C C C C H H H H H H H H
charge: -0.238319 -0.065165 -0.012323 -0.048273 -0.605820 0.082376 -0.074394 0.309093 0.120900 0.129502 -0.340292 -0.370828 -0.226535 -0.223012 -0.231545 -0.375457 0.269448 0.264866 0.233728 0.232793 0.234433 0.252199 0.344292 0.338334
chargesum: 0.00000
title: Mulliken charges with hydrogens summed into heavy atoms:
elementType: O N N N N C C C C C C C C C C C
charge: -0.238319 -0.065165 -0.012323 -0.048273 0.076805 0.082376 -0.074394 0.309093 0.120900 0.129502 -0.070843 -0.105962 0.007193 0.009781 0.002888 -0.123258
polarizability: 2.82942532e+02 -3.26756876e+00 1.55831595e+02 1.63843249e-02 1.19371155e-02 5.73983508e+01
1716.lowfreq: 0.0003 0.0008 0.0011 2.9593 5.9782 10.5454 49.0505 63.7668 93.8466
frequency: 49.0056 63.7570 93.8458 163.1289 179.8043 229.9093 275.3847 285.4765 323.4097 398.2529 401.8436 482.7820 515.7281 517.6850 550.2406 564.1664 572.4542 592.3318 613.9579 655.3490 656.6758 685.9543 697.6960 743.2048 782.7475 791.1211 826.7298 842.5433 859.5920 926.1816 944.4575 963.8497 970.8582 988.0064 991.0428 1005.9181 1027.6620 1077.4835 1090.1424 1173.5753 1175.7474 1190.0462 1235.0135 1259.2968 1305.5162 1317.8179 1324.4628 1372.9695 1384.8773 1434.0991 1439.7374 1463.1756 1535.9717 1547.3296 1581.6965 1591.1933 1616.2467 1639.1955 3131.1676 3142.2859 3155.7658 3165.7590 3174.2353 3177.7044 3538.1900 3693.5932
redmass: 4.0948 6.3553 5.2403 6.7985 5.5939 4.0816 9.7345 6.7191 5.1912 4.5153 2.8316 3.4864 1.1742 9.0583 1.3707 2.4062 7.1680 7.9581 6.4647 7.4727 10.5412 6.0619 1.8165 7.6998 1.9158 11.1678 12.1990 12.3398 1.2477 1.4395 1.4181 2.5441 6.5897 6.2138 1.3846 1.3292 2.0976 2.8875 2.2387 2.2594 1.2542 1.1848 4.4889 3.9492 8.8419 3.0370 1.7506 1.7080 7.8319 3.0149 2.4357 2.4286 5.4298 8.5163 3.4642 2.5049 4.3890 3.6011 1.0854 1.0890 1.0935 1.0964 1.1004 1.0924 1.0445 1.1055
irintensity: 1.1131 0.4304 1.0061 2.2033 0.2781 6.2133 0.7489 2.1449 0.8390 5.7020 0.0103 15.2968 223.5146 3.6435 25.5910 28.7467 0.0663 1.0791 0.4231 5.5905 12.2173 40.2703 54.5815 14.8005 40.3057 8.7258 10.9983 29.2271 0.0001 13.0027 5.2653 14.5578 52.6777 0.2467 0.0062 0.3885 1.8046 46.7065 7.2577 12.5086 3.5060 4.3307 32.3328 21.9660 60.7178 41.6842 20.0244 0.8630 0.5481 25.5344 35.2275 31.5137 1.7737 118.3716 7.8743 13.2093 35.7590 583.3165 0.3807 10.4557 19.3470 13.5490 16.2007 11.8374 137.6996 48.3837
temp: 298.150 k
press: 1.00000 atm
elementType: 8 7 7 7 7 6 6 6 6 6 6 6 6 6 6 6 1 1 1 1 1 1 1 1
symmnumber: 1
zpe: 461561.5 jmol-1
zpe.correction: 0.175799 hartree
zpe.thermalcorrener: 0.187679 hartree
zpe.thermalcorrenthalpy: 0.188624 hartree
zpe.thermalcorrgfe: 0.137080 hartree
zpe.sumelectzpe: -717.110574 hartree
zpe.sumelectthermal: -717.098694 hartree
zpe.sumelectthermalent: -717.097750 hartree
zpe.sumelectthermalfe: -717.149293 hartree
dipole: 2.0069 3.5579 0.0008
dipole: 4.0849
quadrupole: -77.9244 -83.9018 -95.8597
quadrupole: -9.9476 -0.0011 0.0007
quadrupole: 7.9709 1.9935 -9.9644 -9.9476 -0.0011 0.0007
hfenergy: -717.2863736 hartree
pointgroup: C01 [X(C11H8N4O1)]
dipole: -0.8112761 -1.3873251 0.0003336 debye
dipolederiv: -0.8721545 -0.1798241 0.000057 -0.1474835 -0.4837618 0.0000069 0.0001096 0.0000544 -0.1276516 -0.566662 0.0249879 0.0000346 0.3323329 -0.4015466 -0.0000155 0.0000652 -0.0000185 -0.223717 -1.0225747 -0.0409177 0.0000424 -0.0576423 -0.5594746 0.0001081 0.0000382 -0.0000176 -0.1894033 -0.3947071 -0.2749441 0.000055 0.2373792 -0.9741989 0.0000402 -0.0000911 0.0001412 -0.2283999 -0.2912189 0.2166935 -0.0000514 0.7551805 -1.4133551 0.000076 -0.0001094 0.0000972 -0.6739152 1.0509263 0.0780033 -0.0000797 0.1744269 0.5992099 0.0000067 -0.0000795 -0.000025 0.1030756 -0.225268 0.3898794 -0.0000085 0.0429392 -0.4008048 0.0000658 0.0000029 0.0000649 0.0514425 -0.100698 -0.0293437 0.000011 -0.0585556 -0.0237646 -0.0000011 -0.0000357 0.0000039 0.011576 0.8603337 0.2178764 -0.0001291 0.1328099 0.475731 -0.0000889 -0.0001442 -0.0000867 0.1587702 0.6273426 -0.2669939 0.000016 -0.8559347 1.7642772 -0.0001783 -0.0000101 -0.0001635 0.2004592 0.0127914 0.0987982 -0.0000174 -0.0669875 0.0005744 -0.0000052 0.0000067 -0.0000132 -0.125112 -0.0487067 -0.0879832 0.0000055 0.082303 0.0019484 -0.0000202 -0.0000176 -0.0000033 -0.1299461 -0.089267 -0.1482891 0.000011 -0.2454272 0.0724835 -0.0000034 0.0000294 -0.0000125 -0.1491764 -0.0719977 0.1404737 -0.0000192 0.2058013 0.0774818 -0.0000374 -0.000026 -0.0000322 -0.1484527 0.0234166 0.0076722 -0.0000094 0.0203761 -0.0006996 -0.0000137 -0.0000127 -0.0000142 -0.1468366 0.6608206 -0.0410739 0.0000027 -0.3333379 0.724865 -0.0000572 0.0003771 0.0000202 -0.0672757 0.0988125 -0.0685855 0.0000091 -0.0677965 0.010952 0.0000189 0.0000088 0.0000183 0.1595923 0.0867307 0.0814746 -0.0000047 0.0637425 0.0079189 0.0000113 -0.0000054 0.0000092 0.1556622 0.006174 0.0816063 0.0000025 0.1154957 -0.0568261 0.0000124 -0.0000008 0.0000141 0.158709 0.0122054 -0.0771506 0.0000173 -0.113922 -0.0650226 0.0000291 0.0000214 0.0000274 0.1586289 -0.133598 -0.0039222 0.0000192 -0.0048018 0.0941202 0.0000066 0.0000176 0.0000066 0.1607937 -0.0153144 -0.0795551 0.0000121 -0.0780751 0.0311689 0.0000118 -0.0002002 -0.0000748 0.1301328 0.1322461 0.0332666 0.0000084 -0.072774 0.2831376 0.0000113 0.0000479 -0.0000106 0.3794887 0.260367 -0.0721489 0.0000157 -0.0600491 0.2355861 0.0000157 0.0000077 0.0000147 0.3815555 unknown
polarizability: 282.8100686|-5.243756|155.9640577|-0.0165681|-0.0116807|57.3983508 unknown
InChI: InChI=1S/C11H8N4O/c12-9-8-11(14-6-13-9)16-10(15-8)7-4-2-1-3-5-7/h1-6H,12H2
charge 0 multiplicity 1
24 atoms
O  0.200296 1.281795 -0.000285
N  0.392337 -1.039011 -0.000268
N  2.581767 1.852263 -0.00067
N  4.056576 -0.122277 -0.000477
N  3.233883 -2.338807 -0.000113
C  -0.457286 -0.009004 -0.000198
C  1.671855 -0.448796 -0.000309
C  -1.913524 -0.01516 -0.000095
C  1.572275 0.960347 -0.000495
C  2.988646 -0.993112 -0.000254
C  -2.652702 1.199909 -0.000158
C  -2.600783 -1.2618 0.000061
C  -4.061826 1.16316 -0.000069
C  -4.008466 -1.287473 0.000154
C  -4.744367 -0.076679 0.000088
C  3.803072 1.219514 -0.000836
H  -2.117509 2.154368 -0.000276
H  -2.016649 -2.187682 0.00011
H  -4.628587 2.100545 -0.00012
H  -4.534609 -2.248292 0.000281
H  -5.839755 -0.099981 0.000159
H  4.679924 1.8724 -0.000581
H  2.462623 -3.002576 -0.000021
H  4.201209 -2.657653 -0.000126
