program: Gaussian 09
title: 000283159
version: EM64L-G09RevD.01
frameworkgroup: C1[X(C7H8N4O)]
method: RPBEPBE
basis: SDD
operation: Freq
keyword: #pfreq=noraman
keyword: PBEPBE/SDD
title: #p freq=noraman PBEPBE/SDD
converged: YES YES NO NO
title: Mulliken charges:
elementType: O N N N N C C C C C C C H H H H H H H H
charge: -0.225451 -0.068501 -0.008028 -0.048985 -0.608224 0.216985 -0.473474 -0.079836 0.113113 0.127366 -0.670203 -0.380523 0.234678 0.242065 0.226765 0.227129 0.242021 0.251283 0.344210 0.337610
chargesum: 0.00000
title: Mulliken charges with hydrogens summed into heavy atoms:
elementType: O N N N N C C C C C C C
charge: -0.225451 -0.068501 -0.008028 -0.048985 0.073596 0.216985 0.003269 -0.079836 0.113113 0.127366 0.025712 -0.129240
polarizability: 1.52037572e+02 -1.05656477e+00 1.11386286e+02 -5.74077173e+00 2.53512694e-01 5.49155048e+01
1716.lowfreq: -6.9507 -5.6650 0.0005 0.0007 0.0007 4.4533 40.7566 92.3814 161.4405
frequency: 40.7376 92.3807 161.4396 173.6079 209.4836 232.3626 280.9517 330.4034 392.7400 478.0152 515.3321 531.7421 543.6603 560.5792 577.5006 619.1812 659.1151 688.4932 753.2519 779.1722 793.0693 832.8799 841.6979 930.6171 953.5159 962.6619 1053.7647 1061.2818 1074.1213 1161.6167 1204.2790 1250.1010 1268.2797 1303.6697 1314.1290 1322.9505 1373.9393 1391.8145 1436.7066 1454.7179 1475.4398 1485.5561 1539.7986 1550.5407 1590.4877 1639.2025 2995.9124 3003.7050 3076.3147 3095.7391 3107.1840 3175.4188 3542.3094 3696.3741
redmass: 2.6950 3.7313 6.6182 1.6881 3.0380 1.8858 7.3325 2.7336 4.1386 6.2232 1.1951 4.3738 1.1532 4.0616 4.6100 7.3691 10.9903 6.2050 5.8438 1.5635 11.6911 3.9938 11.1285 1.4345 2.3798 2.2668 2.5162 4.4033 1.7341 3.4270 3.0327 2.1030 2.0488 4.0655 1.9943 3.3401 1.7032 1.2022 3.1832 1.0863 1.0431 1.0716 5.3053 8.6859 1.8187 3.3132 1.0349 1.0637 1.0976 1.1009 1.1010 1.0924 1.0445 1.1055
irintensity: 0.7924 0.6761 2.4270 2.6051 0.4761 3.9254 1.7477 3.8806 4.8026 1.2802 254.5292 1.3720 26.3814 14.5242 10.8570 2.4266 13.2373 5.3795 14.6697 3.9648 4.7382 4.8252 35.2714 12.9832 37.2903 6.7201 18.2133 59.3483 3.6307 22.1483 15.3441 2.7781 42.6735 27.2319 22.3455 78.7441 2.0703 6.7227 29.5700 10.7199 13.5035 7.1401 9.4648 100.9777 25.8794 588.8207 31.5322 14.3452 1.3591 36.5872 27.8122 12.5132 119.9561 50.4591
temp: 298.150 k
press: 1.00000 atm
elementType: 8 7 7 7 7 6 6 6 6 6 6 6 1 1 1 1 1 1 1 1
symmnumber: 1
zpe: 398236.5 jmol-1
zpe.correction: 0.151680 hartree
zpe.thermalcorrener: 0.161911 hartree
zpe.thermalcorrenthalpy: 0.162856 hartree
zpe.thermalcorrgfe: 0.115448 hartree
zpe.sumelectzpe: -564.908504 hartree
zpe.sumelectthermal: -564.898273 hartree
zpe.sumelectthermalent: -564.897329 hartree
zpe.sumelectthermalfe: -564.944736 hartree
dipole: 1.3330 3.6016 0.0675
dipole: 3.8410
quadrupole: -60.1050 -69.5978 -70.4714
quadrupole: -5.0185 -0.8366 0.0582
quadrupole: 6.6197 -2.8730 -3.7467 -5.0185 -0.8366 0.0582
hfenergy: -565.0601844 hartree
pointgroup: C01 [X(C7H8N4O1)]
dipole: -0.5890953 -1.3786301 -0.1895477 debye
dipolederiv: -0.9008983 -0.2101243 -0.0902736 -0.0635646 -0.5429476 -0.0562296 -0.0890169 -0.0740427 -0.1392387 -0.6218099 0.0384813 -0.004036 0.1550002 -0.4218671 -0.0293326 -0.0214283 -0.0252906 -0.2339584 -0.9240501 -0.0707859 -0.0734334 -0.0544609 -0.5791755 -0.0577344 -0.0781381 -0.0610942 -0.2048595 -0.3944961 -0.2191207 -0.0439612 0.2824342 -0.9694954 -0.0786642 0.0251694 -0.1275699 -0.2476703 -0.3142536 0.3110588 0.0855766 0.5894239 -1.3661717 -0.0553689 0.1200596 -0.0664411 -0.6797564 0.8476233 0.0364163 0.0288657 0.0410151 0.7059664 0.0821481 0.1128805 0.0872176 0.0358502 -0.1127514 -0.0034274 0.0242876 0.121955 0.0800559 -0.0287237 0.1014652 -0.0328641 0.0707265 -0.1235423 0.4352913 0.062933 0.1979006 -0.3911605 -0.043471 0.0079618 -0.0210667 0.0506949 0.9067016 0.2302351 0.1023957 -0.0535276 0.496659 0.0384416 0.0669174 0.0694173 0.1639684 0.5517946 -0.3918524 -0.0356801 -0.676483 1.7072078 0.1680354 -0.0663306 0.1765713 0.229319 -0.005873 0.0027655 0.0136614 -0.0669313 0.0598548 -0.0238845 -0.1228898 -0.0229029 0.0319364 0.689929 -0.0460447 0.0677588 -0.2864398 0.686369 0.0821294 0.0341557 0.1048711 -0.049663 -0.0144217 0.0157414 -0.0219237 0.0253999 0.0447045 0.1117022 -0.0391567 0.0750896 -0.0424553 0.0449632 0.0053981 0.0118246 -0.0507039 -0.0694004 -0.0787893 0.013461 -0.0499105 0.0733975 0.097407 0.0574935 -0.0492353 0.0316597 0.0051449 0.1147521 0.0012679 0.0827117 -0.0662651 -0.2334082 -0.0080139 -0.0067913 -0.0014486 0.1079404 -0.0128719 0.003162 -0.0134341 0.0691218 0.1175999 -0.0648856 -0.0047761 -0.0269584 -0.0905603 -0.0682785 0.0039281 -0.0374451 0.0617171 0.0020679 -0.0809833 -0.0233929 -0.0769855 0.0201227 -0.0229778 -0.0242859 -0.0243909 0.1244633 0.1479667 0.0297739 -0.0188033 -0.0433195 0.2868663 -0.0151973 -0.0291949 -0.0107673 0.3765375 0.2394513 -0.0674169 -0.0249964 -0.0439654 0.229887 -0.0256851 -0.0199873 -0.0286585 0.3761341 unknown
polarizability: 151.9435004|-3.6723758|110.2971518|4.3716817|8.4191597|56.0987104 unknown
InChI: InChI=1S/C7H8N4O/c1-2-4-11-5-6(8)9-3-10-7(5)12-4/h3H,2,8H2,1H3
charge 0 multiplicity 1
20 atoms
O  -1.181639 1.075114 -0.039204
N  -0.798112 -1.19876 -0.324915
N  1.13387 1.813822 0.294223
N  2.765108 -0.029554 0.190422
N  2.140607 -2.2778 -0.19148
C  -1.718364 -0.242093 -0.280888
C  -3.200453 -0.337607 -0.42735
C  0.429282 -0.524517 -0.107494
C  0.209853 0.859456 0.06833
C  1.780563 -0.966768 -0.039278
C  -3.960954 0.075684 0.861206
C  2.398164 1.276845 0.340556
H  -3.523353 0.309461 -1.265201
H  -3.433763 -1.380643 -0.700102
H  -3.689447 -0.579727 1.707042
H  -5.049845 -0.003477 0.697912
H  -3.725438 1.116847 1.139478
H  3.211932 1.984449 0.521274
H  1.432447 -2.987912 -0.363172
H  3.126044 -2.526217 -0.132057
