program: Gaussian 09
title: 000283128
version: EM64L-G09RevD.01
frameworkgroup: C1[X(C19H14O)]
method: RPBEPBE
basis: SDD
operation: Freq
keyword: #pfreq=noraman
keyword: PBEPBE/SDD
title: #p freq=noraman PBEPBE/SDD
converged: YES YES NO NO
title: Mulliken charges:
elementType: O C C C C C C C C C C C C C C C C C C C H H H H H H H H H H H H H H
charge: -0.232710 0.148521 -0.194724 -0.521285 -0.558222 0.326157 0.517910 0.202831 -0.433384 -0.469479 -0.399677 -0.446421 -0.213642 -0.001834 0.300903 -0.379662 -0.371519 -0.238036 -0.234106 -0.232364 0.268373 0.246143 0.237055 0.236499 0.243523 0.239525 0.262243 0.241693 0.221961 0.269939 0.269653 0.230814 0.231381 0.231941
chargesum: 0.00000
title: Mulliken charges with hydrogens summed into heavy atoms:
elementType: O C C C C C C C C C C C C C C C C C C C
charge: -0.232710 0.148521 -0.194724 -0.006768 -0.084669 0.326157 0.517910 0.202831 -0.189861 -0.229953 -0.137434 -0.204728 0.008319 -0.001834 0.300903 -0.109723 -0.101866 -0.007221 -0.002725 -0.000423
polarizability: 3.48259148e+02 -7.31818043e-01 2.03645369e+02 1.24206685e+01 -5.69767910e+00 1.08719003e+02
1716.lowfreq: -5.1674 -0.0010 -0.0007 -0.0005 2.7409 8.6990 31.2818 53.2536 60.1760
frequency: 31.2685 53.2333 60.1752 100.9480 113.1998 161.6651 172.0613 214.5433 224.7506 244.5822 277.8544 347.0862 398.5434 404.9728 444.4883 451.8470 472.8286 490.1871 512.9848 554.6581 561.7315 580.8306 614.0815 630.6412 643.1779 647.4154 690.0660 702.6566 725.2479 751.3655 775.0879 796.0714 817.1302 822.5642 844.7968 857.1254 863.5052 907.9510 942.1811 953.2064 976.3255 983.2586 987.3912 990.3130 990.9671 1002.9644 1003.4198 1007.6215 1028.1035 1043.6181 1083.1326 1102.8949 1140.2398 1161.2503 1173.6526 1176.8559 1187.9480 1191.0744 1198.9789 1220.5179 1240.5315 1250.8812 1281.7936 1289.5792 1318.0755 1353.9541 1382.1594 1395.3077 1416.1677 1431.8539 1434.3673 1457.5790 1466.1605 1469.9811 1477.2989 1496.1147 1522.8704 1582.7449 1591.1442 1607.1317 1607.4903 1625.7330 2994.6861 3018.1795 3040.8846 3066.9013 3122.0325 3126.5354 3129.1771 3136.2776 3137.2082 3147.5761 3154.3498 3155.7931 3157.8026 3167.8788
redmass: 5.5911 3.9819 5.1699 5.7223 1.8420 4.9867 5.5868 3.2187 3.6797 5.5104 4.9171 8.3286 4.3603 2.9653 4.0760 3.4416 4.4823 3.9852 6.2370 2.5838 6.7295 4.9545 6.4431 5.3846 4.4766 6.0083 5.4959 1.9915 2.3229 1.7695 1.2358 2.6040 3.8113 4.0356 2.1405 1.8985 1.3588 1.4560 1.4484 3.2820 1.3449 1.4072 5.5160 6.1117 1.4111 1.7625 1.5430 3.8092 2.2061 1.9984 1.5865 2.5201 1.1898 2.6198 1.0572 1.2037 1.1461 1.1229 1.5095 1.3436 1.9604 1.9886 2.9111 2.0718 1.3716 3.3985 8.7264 4.3306 1.9006 2.0845 1.4217 1.2918 2.6440 3.4847 2.3641 3.6175 9.6402 6.6670 7.6426 6.9100 6.0708 7.8403 1.0609 1.0632 1.1014 1.0998 1.0858 1.0850 1.0876 1.0882 1.0922 1.0927 1.0983 1.0960 1.0956 1.1012
irintensity: 1.6824 0.2506 1.2008 1.5139 0.1199 1.9943 1.7507 6.6680 4.4737 0.8928 4.9183 2.4772 1.3682 1.1778 2.1852 0.6024 3.3238 1.9763 2.9686 0.2202 9.1402 13.6235 0.6423 2.2222 2.4389 3.0230 12.5713 45.5069 62.9993 7.1405 37.1324 13.1358 12.6565 25.6413 15.6982 42.7125 18.7639 2.1744 2.4121 3.6696 2.9030 1.8104 17.6322 29.5518 6.2056 2.1717 1.4635 3.2882 2.8005 14.5170 8.7885 0.1876 0.2908 8.9773 0.2275 3.3783 22.0104 0.2301 4.4959 21.5832 23.0898 27.6422 276.5269 67.6184 21.9642 21.8514 2.2285 0.4281 6.4525 7.4714 1.8245 12.5427 26.4871 21.2517 9.3631 6.9161 139.1890 41.4844 64.2151 5.9630 17.8110 66.5810 28.4770 10.8101 7.0762 13.0379 1.1074 0.8789 3.8482 5.7923 20.6179 26.1641 42.4443 9.0854 23.0951 28.0442
temp: 298.150 k
press: 1.00000 atm
elementType: 8 6 6 6 6 6 6 6 6 6 6 6 6 6 6 6 6 6 6 6 1 1 1 1 1 1 1 1 1 1 1 1 1 1
symmnumber: 1
zpe: 704381.8 jmol-1
zpe.correction: 0.268285 hartree
zpe.thermalcorrener: 0.283409 hartree
zpe.thermalcorrenthalpy: 0.284354 hartree
zpe.thermalcorrgfe: 0.225196 hartree
zpe.sumelectzpe: -806.316669 hartree
zpe.sumelectthermal: -806.301544 hartree
zpe.sumelectthermalent: -806.300600 hartree
zpe.sumelectthermalfe: -806.359758 hartree
dipole: 0.6822 -2.1084 0.9145
dipole: 2.3973
quadrupole: -93.3189 -110.9030 -117.4345
quadrupole: 7.2230 1.3472 0.5777
quadrupole: 13.8999 -3.6842 -10.2157 7.2230 1.3472 0.5777
hfenergy: -806.5849537 hartree
pointgroup: C01 [X(C19H14O1)]
dipole: 0.3544919 0.4042946 -0.7749074 debye
polarizability: 346.4920634|-20.8876888|164.7283835|-2.4200699|-47.7098698|149.4030732 unknown
InChI: InChI=1S/C19H14O/c20-19(15-5-2-1-3-6-15)17-12-10-14-8-4-7-13-9-11-16(17)18(13)14/h1-8,10,12H,9,11H2
charge 0 multiplicity 1
34 atoms
O  -1.652122 -1.373176 1.609301
C  0.954164 -0.825552 0.485236
C  2.224734 -0.331882 0.076718
C  1.145981 -2.176772 1.163974
C  2.682389 -2.491196 1.021363
C  3.280119 -1.24603 0.371934
C  2.427228 0.935107 -0.554428
C  -0.195421 -0.051815 0.22388
C  4.58866 -0.890957 0.036187
C  1.249649 1.728958 -0.774746
C  -0.006758 1.240723 -0.403784
C  3.77883 1.276837 -0.886562
C  4.820199 0.380581 -0.593061
C  -1.543771 -0.534775 0.653601
C  -2.79099 -0.051907 -0.041337
C  -2.820887 0.271032 -1.425046
C  -3.999208 -0.009198 0.705121
C  -4.035213 0.640975 -2.044189
C  -5.206609 0.378799 0.09099
C  -5.227764 0.706095 -1.286871
H  0.831495 -2.113873 2.220422
H  0.506032 -2.958383 0.715912
H  2.851305 -3.385108 0.391128
H  3.14452 -2.704752 2.002767
H  5.434953 -1.556216 0.240065
H  1.338312 2.722431 -1.229343
H  -0.887825 1.871538 -0.56052
H  3.99848 2.23643 -1.368591
H  5.849094 0.656428 -0.852876
H  -1.905235 0.201694 -2.021626
H  -3.966587 -0.292776 1.762338
H  -4.052107 0.873319 -3.114776
H  -6.130411 0.421614 0.678339
H  -6.167538 1.001308 -1.767121
