program: Gaussian 09
title: 000283117
version: EM64L-G09RevD.01
frameworkgroup: C1[X(C14H12BrNO)]
method: RPBEPBE
basis: SDD
operation: Freq
keyword: #p
keyword: freq=noraman
keyword: PBEPBE/SDD
title: #p freq=noraman PBEPBE/SDD
converged: YES YES NO NO
title: Mulliken charges:
elementType: Br O N C C C C C C C C C C C C C C H H H H H H H H H H H H
charge: -0.005856 -0.250724 -0.439929 0.060335 -0.124578 -0.557607 -0.549846 0.316752 0.620551 0.324055 -0.438575 -0.412891 -0.389687 -0.424209 -0.202845 0.213520 -0.804852 0.235537 0.235523 0.238980 0.238985 0.246112 0.253178 0.306911 0.241936 0.324785 0.237481 0.271036 0.235924
chargesum: 0.00000
title: Mulliken charges with hydrogens summed into heavy atoms:
elementType: Br O N C C C C C C C C C C C C C C
charge: -0.005856 -0.250724 -0.115144 0.060335 -0.124578 -0.086548 -0.071881 0.316752 0.620551 0.324055 -0.192463 -0.159714 -0.082776 -0.424209 0.039090 0.213520 -0.060411
polarizability: 2.77989554e+02 1.04762936e+01 2.13638149e+02 -5.81867637e-03 2.17242880e-02 7.81700907e+01
1716.lowfreq: -77.2581 -4.0704 0.0001 0.0004 0.0006 5.2185 5.4499 50.6812 52.4736
frequency: -77.2563 50.6711 52.4630 88.6087 92.9605 100.4931 153.1196 164.7929 207.7355 246.4257 257.5196 288.3065 311.1356 337.6817 451.1131 466.9355 483.7519 502.2544 521.8456 538.9706 578.5577 582.4557 619.0124 631.7748 640.6463 674.4839 687.7832 755.4442 760.4081 818.7724 829.5613 845.7449 860.1630 878.2366 935.4791 952.2401 967.6334 1001.0389 1003.3586 1008.9657 1017.4456 1030.6285 1077.9007 1115.0051 1148.4291 1184.6565 1206.1554 1212.0207 1218.6896 1223.6761 1251.2817 1286.7057 1302.6074 1346.1738 1374.3998 1375.6784 1396.1637 1426.1428 1447.0221 1458.7811 1462.2426 1468.9386 1472.8656 1486.2501 1520.1382 1591.5636 1610.0657 1627.4036 1636.8692 2970.3581 2987.8167 3002.1098 3013.0909 3052.7144 3072.8034 3137.7659 3138.5523 3156.1723 3166.2317 3191.5982 3525.9567
redmass: 1.0455 6.4168 4.2672 4.0930 8.0275 1.9222 4.0757 5.6644 3.4298 8.1027 10.7720 4.4493 4.0109 4.2930 3.6194 4.3675 4.3972 5.6222 3.1607 6.2489 3.0655 3.7829 6.1433 1.3554 5.6315 2.8396 6.2065 1.9850 5.1626 1.5605 5.5294 1.6602 1.6185 5.0101 1.3724 3.6917 2.3205 1.3137 3.4603 1.9111 3.3446 1.6602 2.2837 2.6196 1.1574 1.3946 1.9316 1.0991 2.2043 1.3952 2.1137 1.7276 2.3122 3.2726 2.9645 1.3351 3.3854 1.9513 1.1379 1.2785 2.4732 1.0469 1.5600 3.3834 2.8214 7.6431 7.2097 8.0386 5.0723 1.0589 1.0384 1.0610 1.1030 1.1028 1.0984 1.0978 1.0898 1.0900 1.0948 1.0945 1.0761
irintensity: 0.0395 8.2536 1.8301 0.2784 1.5650 0.2871 0.3661 3.9975 9.7682 4.8608 1.5162 0.4960 0.6563 0.0141 1.1318 14.2284 3.4621 4.4435 9.2366 9.0805 2.0887 3.0052 2.2258 58.3290 4.0852 11.2578 11.8356 0.5265 0.0418 34.5923 41.6382 4.3797 61.5484 0.8562 0.0264 3.3734 44.3944 2.2070 10.1119 1.0325 15.2645 7.5126 19.9485 1.2844 0.0282 12.7948 0.8124 0.1147 55.4956 3.9975 12.2962 16.7263 155.4325 83.2472 30.0101 92.2295 48.9780 180.3514 37.4265 10.3247 6.2697 20.6520 4.9204 184.8564 156.3598 13.9820 46.1673 122.6554 128.3979 29.6017 8.9474 44.9566 8.7094 23.4400 15.5470 7.9279 11.9565 4.4823 7.7412 9.1497 10.8163
temp: 298.150 k
press: 1.00000 atm
elementType: 35 8 7 6 6 6 6 6 6 6 6 6 6 6 6 6 6 1 1 1 1 1 1 1 1 1 1 1 1
symmnumber: 1
zpe: 584612.7 jmol-1
zpe.correction: 0.222667 hartree
zpe.thermalcorrener: 0.236884 hartree
zpe.thermalcorrenthalpy: 0.237828 hartree
zpe.thermalcorrgfe: 0.180024 hartree
zpe.sumelectzpe: -682.971358 hartree
zpe.sumelectthermal: -682.957141 hartree
zpe.sumelectthermalent: -682.956197 hartree
zpe.sumelectthermalfe: -683.014001 hartree
dipole: -3.2375 5.8438 0.0060
dipole: 6.6807
quadrupole: -94.0535 -104.8437 -111.7635
quadrupole: -11.1904 -0.0298 -0.0105
quadrupole: 9.5001 -1.2901 -8.2100 -11.1904 -0.0298 -0.0105
hfenergy: -683.1940249 hartree
pointgroup: C01 [X(C14H12Br1N1O1)]
dipole: 0.5102695 -2.5783627 0.002374 debye
polarizability: 278.0770859|-10.2035405|213.5506164|-0.001098|-0.0224632|78.1700907 unknown
InChI: InChI=1S/C14H12BrNO/c1-8(17)16-13-7-5-10-12(15)6-3-9-2-4-11(13)14(9)10/h3,5-7,16H,2,4H2,1H3
charge 0 multiplicity 1
29 atoms
Br -3.497185 2.990679 0.000752
O  3.941192 1.635076 -0.001931
N  2.728379 -0.380513 -0.0010
C  0.350055 -0.890919 -0.000451
C  -1.001507 -0.457484 -0.00005
C  0.388123 -2.419627 -0.000539
C  -1.129377 -2.857679 -0.000139
C  -1.91808 -1.549695 0.000139
C  -1.389977 0.921138 0.00011
C  1.376342 0.066061 -0.000662
C  -3.285488 -1.277918 0.000508
C  -0.321992 1.876234 -0.000157
C  1.015685 1.46387 -0.000534
C  -2.806624 1.146791 0.000488
C  -3.725694 0.091077 0.000685
C  3.910186 0.370954 -0.000913
C  5.177188 -0.487082 0.001385
H  0.911947 -2.819823 -0.891363
H  0.912448 -2.81993 0.889945
H  -1.365974 -3.473179 0.887349
H  -1.366453 -3.473092 -0.887559
H  -4.035627 -2.075906 0.000665
H  -0.553411 2.945925 -0.000099
H  1.821424 2.200286 -0.000864
H  -4.797869 0.308652 0.000977
H  2.849098 -1.396118 -0.000831
H  5.232167 -1.118682 0.90757
H  6.050627 0.179852 -0.016573
H  5.217499 -1.149048 -0.883605
