program: Gaussian 09
title: 000283208
version: EM64L-G09RevD.01
frameworkgroup: C1[X(C25H22N2)]
method: RPBEPBE
basis: SDD
operation: Freq
keyword: #pfreq=noraman
keyword: PBEPBE/SDD
title: #p freq=noraman PBEPBE/SDD
converged: YES YES NO NO
title: Mulliken charges:
elementType: N N C C C C C C C C C C C C C C C C C C C C C C C C C H H H H H H H H H H H H H H H H H H H H H H
charge: -0.207936 -0.476618 -0.348755 0.509084 0.410939 0.426681 -0.457443 -0.366843 -0.349648 -0.415775 0.516086 -0.367234 -0.386266 -0.229929 -0.238857 -0.237884 -0.246795 -0.238971 -0.246808 -0.236127 -0.219565 -0.462482 -0.328880 -0.268071 -0.190997 -0.217823 -0.277086 0.213398 0.289747 0.233270 0.249938 0.244675 0.251329 0.237211 0.270053 0.224902 0.227417 0.224325 0.228418 0.227612 0.230347 0.220915 0.222498 0.218363 0.251587 0.226715 0.218109 0.219639 0.223534
chargesum: 0.00000
title: Mulliken charges with hydrogens summed into heavy atoms:
elementType: N N C C C C C C C C C C C C C C C C C C C C C C C C C
charge: -0.207936 -0.186872 -0.135357 0.509084 0.410939 0.426681 -0.224173 -0.116904 -0.104973 -0.164445 0.516086 -0.130023 -0.116212 -0.005027 -0.011440 -0.013559 -0.018377 -0.011360 -0.016461 -0.015212 0.002933 -0.244119 -0.077293 -0.041356 0.027112 0.001816 -0.053552
polarizability: 3.12144875e+02 -1.62226890e+01 2.83172365e+02 -3.27622266e+00 -7.04354980e+00 2.32335331e+02
1716.lowfreq: -12.5500 -6.6107 -2.7004 0.0001 0.0005 0.0006 11.5159 27.3680 36.0522
frequency: 11.3124 27.3498 35.8228 42.3199 45.3752 56.0233 58.5642 72.3186 73.4866 129.3920 155.5328 185.1082 189.3027 225.2300 244.0691 253.2724 295.5323 310.6209 330.8395 351.5690 379.4165 403.6007 407.2160 408.3484 409.1656 459.0932 487.6165 504.6404 513.8783 529.5457 589.2225 609.2542 612.9216 613.6318 614.6775 617.8792 643.0971 673.6072 690.9894 693.7964 704.1762 706.3092 737.9136 751.3300 753.0262 756.2634 803.4171 814.7648 822.4479 825.7137 847.9693 853.6487 860.1687 873.6225 880.8610 886.5866 929.5391 937.2373 957.5013 960.1201 976.9248 977.6061 978.1583 980.5506 980.8595 981.6198 990.1031 991.1351 993.6723 995.6566 998.2136 1020.8992 1027.1966 1029.1505 1033.2292 1080.7934 1083.8001 1086.6229 1092.7011 1165.1039 1168.3803 1171.7065 1173.1475 1173.5203 1179.8095 1186.9651 1191.2049 1193.5884 1194.9154 1215.0183 1256.9599 1269.1593 1285.7637 1314.9618 1318.4824 1326.3647 1337.8899 1351.0918 1378.2699 1382.5597 1383.8265 1388.1308 1429.6066 1434.0402 1442.8755 1445.3558 1476.7323 1480.8057 1484.8527 1486.8962 1495.6005 1583.1937 1589.7393 1596.0946 1596.3610 1610.9064 1612.6980 1614.0251 1620.5576 2994.5243 3108.8050 3111.4860 3120.8211 3124.3685 3124.7202 3125.6519 3126.2389 3132.5657 3136.3009 3136.8546 3138.2284 3146.8077 3147.5179 3154.2040 3158.3035 3163.3806 3163.7040 3164.1189 3170.0934 3175.0723 3473.8169
redmass: 5.2849 5.1875 4.8681 4.1088 3.8727 4.2228 3.9589 4.3830 4.4521 5.6051 4.8018 4.3761 4.5348 4.6234 4.7450 5.2741 5.1497 4.6866 5.1075 1.3081 3.8255 2.8092 2.8293 2.9228 2.9085 3.6560 3.8432 2.8825 2.8522 5.4775 6.3551 5.1423 6.3409 6.3977 6.3856 6.2876 6.2557 5.1390 1.9654 1.9343 1.7638 2.1363 1.7088 2.0174 1.8424 1.7677 3.9623 1.9900 1.8062 1.3055 3.4416 1.3070 1.2625 2.7657 1.4612 1.5180 1.4706 1.6834 1.3623 1.4053 1.4127 2.7924 1.4275 2.5150 1.9284 1.7291 4.6172 3.8606 5.8712 1.3572 1.3445 2.1438 2.2902 2.1681 2.0210 1.6196 1.6113 1.6039 1.6067 1.8943 1.1800 1.1165 1.0555 1.0927 1.1245 2.7993 1.1182 1.2156 1.2307 2.1723 2.3256 1.5142 1.7020 1.4810 1.5422 1.3666 1.3986 1.9221 6.1936 5.2411 5.4690 5.7949 2.2071 2.2134 2.1751 2.4875 1.9388 2.1998 2.2568 2.4946 1.9547 6.1908 6.0034 5.6888 5.8021 5.9864 5.9747 6.1056 6.1629 1.0819 1.0870 1.0880 1.0850 1.0847 1.0857 1.0871 1.0863 1.0893 1.0911 1.0932 1.0917 1.0960 1.0959 1.0927 1.0954 1.1015 1.1014 1.0962 1.0984 1.0970 1.0768
irintensity: 0.0558 0.5515 0.6069 0.1519 0.0040 0.3548 0.2816 0.0625 0.2769 0.2944 0.6707 1.6080 0.5388 1.6871 0.3136 0.3021 3.1558 0.3842 8.1233 75.0703 54.8954 0.8976 2.1731 0.2493 0.2726 9.1666 1.4689 13.8143 18.7332 7.5452 3.1172 21.1152 1.3432 1.8867 0.2433 6.1486 16.5367 14.0606 39.6353 41.0374 46.9317 24.4700 60.5629 72.4146 64.2520 45.0840 4.4018 11.6170 2.7622 0.6447 7.9116 2.9519 0.3905 7.2208 7.9432 4.2266 0.8663 3.6673 0.1610 0.0339 0.9709 0.2748 1.1500 1.1363 1.1783 0.4115 6.5410 0.7279 4.3530 0.6444 0.1629 10.6200 8.1730 8.2519 16.3097 4.5390 13.6932 5.0824 5.3466 4.5496 1.0587 0.6107 0.1638 0.3217 7.5106 28.8067 0.7056 0.0680 1.1888 3.1641 147.2850 13.8610 4.8589 10.1341 14.9821 1.7295 23.5537 30.4824 10.5741 28.6878 3.6212 1.2989 3.9698 16.3482 13.6233 2.0129 109.6866 26.1867 18.0606 72.1950 88.3924 2.8883 2.9553 3.8220 3.8528 40.6491 139.7973 11.6354 102.9483 8.8603 12.8557 7.4534 4.3202 6.2872 0.3626 0.0838 0.4540 13.3244 13.8859 29.6233 15.0174 42.2562 33.1779 43.2386 41.3275 30.5603 17.4297 18.5302 7.1127 4.9164 36.7781
temp: 298.150 k
press: 1.00000 atm
elementType: 7 7 6 6 6 6 6 6 6 6 6 6 6 6 6 6 6 6 6 6 6 6 6 6 6 6 6 1 1 1 1 1 1 1 1 1 1 1 1 1 1 1 1 1 1 1 1 1 1
symmnumber: 1
zpe: 1042072.4 jmol-1
zpe.correction: 0.396904 hartree
zpe.thermalcorrener: 0.419456 hartree
zpe.thermalcorrenthalpy: 0.420400 hartree
zpe.thermalcorrgfe: 0.342116 hartree
zpe.sumelectzpe: -1073.465767 hartree
zpe.sumelectthermal: -1073.443215 hartree
zpe.sumelectthermalent: -1073.442271 hartree
zpe.sumelectthermalfe: -1073.520555 hartree
dipole: -1.0766 -1.5666 0.4266
dipole: 1.9482
quadrupole: -151.5546 -154.2315 -145.9091
quadrupole: -0.7335 -2.4721 0.5571
quadrupole: -0.9896 -3.6664 4.6560 -0.7335 -2.4721 0.5571
hfenergy: -1073.862671 hartree
pointgroup: C01 [X(C25H22N2)]
dipole: 0.5886476 0.4471311 0.2025653 debye
polarizability: 299.8100158|-22.0336174|294.5382194|5.2131986|8.7384831|233.3043357 unknown
InChI: InChI=1S/C25H22N2/c1-5-13-21(14-6-1)25(22-15-7-2-8-16-22)27(24-19-11-4-12-20-24)26-23-17-9-3-10-18-23/h1-20,25-26H
charge 0 multiplicity 1
49 atoms
N  0.05457 -0.749495 -0.121073
N  -0.699417 -0.402095 1.001627
C  1.030625 0.264375 -0.622036
C  0.354385 1.630796 -0.796935
C  2.329017 0.318352 0.212127
C  0.117222 -2.121898 -0.505236
C  -0.224089 1.963662 -2.046219
C  3.30236 1.313438 -0.067216
C  0.270702 2.563328 0.265114
C  2.607964 -0.636837 1.219605
C  -2.059482 -0.033311 0.939452
C  1.125499 -2.611087 -1.387023
C  -0.858075 -3.038456 -0.014645
C  -0.879255 3.200636 -2.233316
C  4.519627 1.35436 0.645476
C  -0.390942 3.797448 0.085996
C  3.82376 -0.594083 1.94069
C  -0.967416 4.121313 -1.164056
C  4.784736 0.401344 1.65759
C  1.135001 -3.967635 -1.776595
C  -0.828516 -4.391529 -0.407067
C  -2.730201 0.313833 2.145417
C  -2.77543 -0.018276 -0.286817
C  0.161808 -4.871825 -1.295653
C  -4.093808 0.670844 2.117618
C  -4.138009 0.343849 -0.297396
C  -4.811126 0.690329 0.897763
H  1.30452 -0.07101 -1.641336
H  -0.252678 -0.496503 1.91853
H  -0.164187 1.248668 -2.877015
H  3.098654 2.063455 -0.840703
H  0.726445 2.322647 1.231951
H  1.889065 -1.437145 1.426805
H  1.924562 -1.958102 -1.74941
H  -1.640898 -2.684114 0.660768
H  -1.319855 3.444235 -3.206554
H  5.259108 2.129632 0.414916
H  -0.457996 4.505249 0.91975
H  4.021509 -1.343559 2.715405
H  -1.479222 5.08022 -1.303325
H  5.728198 0.433792 2.213792
H  1.92398 -4.318785 -2.451815
H  -1.593934 -5.073305 -0.018592
H  -2.18282 0.305814 3.096981
H  -2.259169 -0.289915 -1.212117
H  0.17833 -5.923659 -1.599161
H  -4.597438 0.936862 3.054384
H  -4.679353 0.351715 -1.250612
H  -5.869931 0.968931 0.880365
