program: Gaussian 09
title: 000283101
version: EM64L-G09RevD.01
frameworkgroup: C1[X(C13H9ClO2)]
method: RPBEPBE
basis: SDD
operation: Freq
keyword: #p
keyword: freq=noraman
keyword: PBEPBE/SDD
title: #p freq=noraman PBEPBE/SDD
converged: NO YES NO NO
title: Mulliken charges:
elementType: Cl O O C C C C C C C C C C C C C H H H H H H H H H
charge: -0.049851 -0.440258 -0.254606 -0.166061 -0.515890 0.162646 -0.549898 0.320834 0.626754 0.136603 -0.428996 -0.410363 -0.354541 -0.356712 -0.224869 0.086834 0.258043 0.258106 0.240868 0.240888 0.249571 0.262017 0.274361 0.250602 0.383918
chargesum: 0.00000
title: Mulliken charges with hydrogens summed into heavy atoms:
elementType: Cl O O C C C C C C C C C C C C C
charge: -0.049851 -0.056341 -0.254606 -0.166061 0.000259 0.162646 -0.068142 0.320834 0.626754 0.136603 -0.179425 -0.148346 -0.354541 -0.082351 0.025734 0.086834
polarizability: 2.33800423e+02 -8.46696127e+00 1.87218987e+02 -5.30906526e-04 -5.23705761e-03 6.57559665e+01
1716.lowfreq: -6.8798 0.0019 0.0021 0.0025 6.2239 7.2189 62.6944 69.7075 105.5569
frequency: 62.6774 69.7072 105.5540 115.2755 138.4594 198.3457 213.4815 249.0446 307.8183 325.9303 335.7028 388.3501 459.9487 476.8121 488.7585 523.0629 541.5929 576.9998 589.8031 598.3662 637.7884 640.3264 663.2087 712.2214 731.7775 748.8249 825.2914 843.7700 844.8122 856.1662 889.9441 942.6746 959.6645 994.1714 1002.0301 1012.5433 1040.2110 1093.3157 1121.5027 1143.8864 1165.0183 1187.1409 1194.8135 1210.4349 1222.5683 1251.9159 1288.7332 1320.4558 1344.1810 1371.7874 1399.4629 1432.0489 1456.2122 1464.0176 1470.9656 1493.5723 1585.0519 1598.8891 1619.1043 1629.9133 2998.7966 3018.4629 3042.9408 3066.3558 3141.4636 3156.1058 3165.7664 3179.8080 3530.4643
redmass: 8.5755 6.3287 5.1521 1.8808 9.8681 9.4388 3.7940 4.3091 4.1703 8.1783 9.3945 8.0961 3.3848 3.4924 4.3065 6.6013 6.4189 1.6853 2.4040 4.9981 2.5402 5.9909 5.7324 6.1798 3.4100 2.0958 1.6973 1.8293 5.5009 1.6678 7.2639 1.3828 3.1542 1.3348 2.0222 4.1347 3.8841 2.1352 2.3674 1.1810 1.9358 1.4369 1.0986 1.7424 1.3347 2.1624 1.8865 2.8785 3.0112 3.4666 2.9294 1.3347 1.2921 2.8799 3.5905 4.3358 9.2117 7.4645 8.0414 8.5803 1.0603 1.0629 1.1022 1.1005 1.0896 1.0883 1.0951 1.0960 1.0641
irintensity: 1.6195 0.1851 0.0865 0.0003 1.4773 0.3537 8.7572 3.4430 0.0807 6.3821 3.5880 2.7797 0.0785 14.9105 3.5551 11.0324 32.6951 68.4330 14.5953 15.6559 50.8007 1.4134 12.3873 17.7782 32.3108 4.0183 22.6316 21.8957 35.1489 45.4408 53.7728 0.0039 0.0335 0.0367 0.5634 5.6851 359.8120 99.6688 0.5462 0.3668 56.7439 11.1208 0.0056 6.6000 7.1459 2.2908 7.5684 115.4525 29.8504 22.8976 24.0909 3.2437 14.5878 6.0569 9.5571 6.3181 59.1870 39.3985 163.1353 156.2691 23.9942 9.5847 4.0516 13.7887 9.3489 0.9956 6.9244 3.0510 54.1672
temp: 298.150 k
press: 1.00000 atm
elementType: 17 8 8 6 6 6 6 6 6 6 6 6 6 6 6 6 1 1 1 1 1 1 1 1 1
symmnumber: 1
zpe: 481355.0 jmol-1
zpe.correction: 0.183338 hartree
zpe.thermalcorrener: 0.196110 hartree
zpe.thermalcorrenthalpy: 0.197054 hartree
zpe.thermalcorrgfe: 0.143593 hartree
zpe.sumelectzpe: -1110.221830 hartree
zpe.sumelectthermal: -1110.209059 hartree
zpe.sumelectthermalent: -1110.208115 hartree
zpe.sumelectthermalfe: -1110.261576 hartree
dipole: 0.0634 1.6854 0.0011
dipole: 1.6866
quadrupole: -98.7401 -87.8106 -100.8886
quadrupole: -10.9968 0.0013 0.0039
quadrupole: -2.9270 8.0025 -5.0755 -10.9968 0.0013 0.0039
hfenergy: -1110.4051685 hartree
pointgroup: C01 [X(C13H9Cl1O2)]
dipole: -0.0782354 -0.65889 -0.0064859 debye
dipolederiv: -0.3759538 0.3003914 0.0077218 0.4383883 -0.5946149 -0.0120179 0.0092087 -0.010028 -0.0621145 -0.8855632 -0.5535208 0.0007443 -0.7391984 -0.9432693 0.0049706 -0.001542 0.0019139 -0.4260347 -1.0918465 0.1858029 0.012818 0.3252455 -0.7538353 -0.0092708 0.0138316 -0.0067767 -0.3170603 -0.2833717 0.1654088 0.0053247 0.0498882 -0.1442539 -0.0019083 0.0040866 -0.0035202 -0.0339668 0.0870602 0.2183767 0.0025683 0.0236389 -0.1583065 -0.0031301 0.0004823 -0.0057247 0.1017528 0.3349861 -0.0804319 -0.005558 0.1430783 0.3371665 0.0016124 -0.0030479 0.0046933 0.0041111 -0.0109066 -0.0130741 0.0021483 0.0822929 -0.0887633 -0.0038097 0.0031841 -0.0025852 0.1506172 0.0619452 -0.3134054 -0.0045872 -0.0326208 0.2125271 0.003019 -0.0015784 0.0070298 -0.0195503 0.2411965 0.3331957 0.001865 0.3304547 -0.1425597 -0.0075233 0.001769 -0.0075483 0.1179128 -0.9386307 -0.2363023 0.0102471 0.0039096 -0.1726722 -0.0016197 0.0129619 0.0017044 -0.0224866 -0.0253752 0.2728236 0.0006499 0.0504388 -0.0248812 0.0011178 -0.0017488 -0.0020306 -0.1910608 -0.3439145 -0.1959244 0.0001509 -0.0887343 0.0028736 0.0032386 0.001398 0.0047447 -0.1829284 0.2669114 -0.6291668 -0.0123475 -0.8436178 0.7582053 0.021526 -0.0146794 0.0184337 -0.1209613 0.2133785 0.120694 -0.0033079 -0.283802 0.0406869 0.0056395 -0.007414 -0.0000295 -0.1111216 -0.0402359 0.0032797 -0.0004584 0.2348845 -0.0350216 -0.002884 0.002088 0.0004208 -0.0758172 2.3220447 0.3601861 -0.0255713 0.2037269 1.3201039 0.0086627 -0.0268015 0.0064668 0.2202988 0.0274322 -0.0117472 0.0661724 0.0060541 0.0457085 -0.0290147 0.0879152 -0.0487855 -0.0074339 0.0231784 -0.0089546 -0.067178 0.008772 0.0440174 0.0298726 -0.0885577 0.0500729 -0.0013484 0.0420338 0.0183033 0.0199477 -0.0052424 -0.0150416 0.0855843 0.0155135 0.1429287 -0.0239808 0.0409525 0.0146968 -0.0215161 -0.0072805 -0.0099811 -0.0850965 -0.0175607 -0.1430613 -0.027963 0.0234875 -0.0670142 0.0011797 -0.0876345 -0.0610269 -0.0011678 0.0009365 -0.0014829 0.1589775 0.0626017 0.0683621 0.0021303 0.0227772 -0.0186263 -0.0022576 0.0016083 -0.0029063 0.1617807 0.0870332 -0.0663988 0.0002605 -0.0539121 0.0178433 -0.0007217 0.0003587 -0.0005387 0.1552676 -0.0617512 0.0143692 0.0032604 0.0211645 0.1030517 -0.0009046 0.0033264 -0.0008069 0.1583747 0.2233075 0.1000501 0.0033353 0.1973284 0.2806699 -0.0039171 0.0042615 -0.0025841 0.3947355 unknown
polarizability: 235.241033|0.9449139|185.7310201|-2.3764849|1.2843093|65.8033228 unknown
InChI: InChI=1S/C13H9ClO2/c14-11-6-2-7-1-3-8-9(13(15)16)4-5-10(11)12(7)8/h2,4-6,15H,1,3H2
charge 0 multiplicity 1
25 atoms
Cl -3.510687 2.429464 0.048388
O  3.85571 1.571874 -0.065056
O  3.792083 -0.750586 -0.088118
C  -0.548082 -0.422704 -0.024637
C  1.153224 -2.115792 -0.066945
C  0.86131 -0.620783 -0.046665
C  -0.261171 -2.807114 -0.054761
C  -1.262468 -1.656748 -0.027957
C  -1.165289 0.869163 -0.001881
C  1.698816 0.509798 -0.046343
C  -2.659183 -1.620808 -0.007784
C  -0.290055 2.007384 -0.00202
C  -2.595024 0.849167 0.018211
C  1.094041 1.82158 -0.023673
C  -3.321468 -0.34822 0.015429
C  3.168361 0.343451 -0.06892
H  1.749007 -2.38943 -0.956062
H  1.773412 -2.408459 0.799108
H  -0.379384 -3.464624 0.826531
H  -0.404512 -3.444976 -0.946691
H  -3.262995 -2.534274 -0.009261
H  -0.713783 3.015868 0.014781
H  1.763131 2.686429 -0.023848
H  -4.415263 -0.30934 0.03124
H  4.831969 1.38218 -0.080067
