program: Gaussian 09
title: 000283098
version: EM64L-G09RevD.01
frameworkgroup: C1[X(C13H9BrO2)]
method: RPBEPBE
basis: SDD
operation: Freq
keyword: #p
keyword: freq=noraman
keyword: PBEPBE/SDD
title: #p freq=noraman PBEPBE/SDD
converged: NO YES NO YES
title: Mulliken charges:
elementType: Br O O C C C C C C C C C C C C C H H H H H H H H H
charge: 0.006765 -0.441245 -0.252175 -0.173217 -0.513443 0.149526 -0.552755 0.317210 0.677360 0.134356 -0.425087 -0.449291 -0.336687 -0.421996 -0.213785 0.087302 0.258459 0.258465 0.240697 0.240696 0.247544 0.288584 0.259379 0.227622 0.385716
chargesum: 0.00000
title: Mulliken charges with hydrogens summed into heavy atoms:
elementType: Br O O C C C C C C C C C C C C C
charge: 0.006765 -0.055528 -0.252175 -0.173217 0.003481 0.149526 -0.071362 0.317210 0.677360 0.134356 -0.177543 -0.449291 -0.048103 -0.162617 0.013837 0.087302
polarizability: 2.16176079e+02 -5.97248829e+00 2.26978775e+02 -9.87919348e-04 2.25635230e-03 6.65280220e+01
1716.lowfreq: -4.0382 -1.9954 0.0003 0.0004 0.0006 2.7240 58.3046 69.3928 98.7277
frequency: 58.3040 69.3884 98.7275 116.4238 126.6109 166.6869 199.4787 236.4863 251.8131 315.2468 316.5126 375.3142 457.9423 460.3125 478.9343 504.7970 567.1495 575.1872 598.3538 606.5881 635.0056 635.7310 663.1018 732.3530 739.8323 754.2313 791.4471 827.3752 852.1838 891.7239 913.7603 923.8156 959.4941 987.7846 1002.9212 1011.9392 1033.3049 1055.8956 1127.8523 1141.8894 1176.1739 1186.7592 1192.8666 1209.9706 1229.6695 1249.5650 1289.4698 1317.5934 1338.5677 1378.1001 1400.9375 1432.1060 1454.3188 1464.5142 1465.4748 1493.0445 1583.3287 1597.2024 1618.3109 1630.9647 2997.9932 3018.6099 3042.3562 3066.0465 3131.1431 3148.8477 3167.4844 3187.7040 3532.5063
redmass: 7.3482 4.7660 4.4127 2.2752 11.0608 7.8658 3.6150 3.6829 13.1614 7.9214 4.7222 7.6047 3.5447 4.2392 3.4193 6.8186 5.7075 1.8461 2.0852 6.2686 5.1107 2.5510 6.0073 7.0442 3.7879 2.2360 1.3485 5.1937 2.5270 8.0236 1.4245 1.4453 3.2013 1.4012 1.9281 5.0758 3.1297 2.1397 2.7949 1.1861 1.4782 1.4781 1.1009 1.6767 1.6579 2.1227 1.7649 2.6676 3.5098 3.0662 3.0819 1.2993 1.4015 3.1067 2.7700 4.2171 8.8371 7.5192 8.0821 8.4823 1.0602 1.0628 1.1021 1.1004 1.0871 1.0926 1.0972 1.0918 1.0642
irintensity: 0.7793 0.6551 0.7037 0.9869 0.4012 1.5621 0.1988 7.1517 1.8471 6.5847 0.9607 1.8037 2.2008 0.2938 10.3869 3.6048 47.5688 42.9732 69.8325 12.2563 9.9316 30.4864 3.6885 35.1278 12.1218 23.3189 38.3406 19.3604 33.0215 47.2319 0.0072 14.1325 0.0214 0.7860 1.3963 20.4570 164.8457 240.2394 71.6152 0.3669 14.6189 7.2862 0.0113 5.7020 5.3521 8.2000 4.0036 106.2128 49.2478 34.5889 29.2582 2.0581 14.5418 1.2155 7.8238 26.2707 40.9889 53.2755 124.8674 204.1221 23.7974 9.4474 4.0851 13.6570 6.4726 16.0807 17.5542 3.1348 57.0559
temp: 298.150 k
press: 1.00000 atm
elementType: 35 8 8 6 6 6 6 6 6 6 6 6 6 6 6 6 1 1 1 1 1 1 1 1 1
symmnumber: 1
zpe: 480082.5 jmol-1
zpe.correction: 0.182854 hartree
zpe.thermalcorrener: 0.195890 hartree
zpe.thermalcorrenthalpy: 0.196834 hartree
zpe.thermalcorrgfe: 0.142083 hartree
zpe.sumelectzpe: -663.620729 hartree
zpe.sumelectthermal: -663.607693 hartree
zpe.sumelectthermalent: -663.606749 hartree
zpe.sumelectthermalfe: -663.661500 hartree
dipole: 1.1444 2.0780 0.0004
dipole: 2.3723
quadrupole: -102.6507 -83.5122 -103.8211
quadrupole: 1.4443 0.0017 -0.0031
quadrupole: -5.9894 13.1491 -7.1597 1.4443 0.0017 -0.0031
hfenergy: -663.8035827 hartree
pointgroup: C01 [X(C13H9Br1O2)]
dipole: 0.543104 -0.7590581 -0.0031059 debye
dipolederiv: -0.0696501 -0.1450203 0.0013814 -0.1021848 -0.7358465 0.0057283 0.001103 0.0067249 -0.0353043 -1.0724417 0.4988766 0.006412 0.7173645 -0.7333885 -0.0086694 0.005432 -0.0057769 -0.4240364 -1.0130886 -0.2666787 0.0117848 -0.3736237 -0.8496178 0.0085356 0.0127451 0.0073866 -0.3147667 -0.2388417 0.0022044 0.0031323 -0.1381436 -0.1988498 0.0030388 0.0040516 0.0011143 -0.0248681 0.1179017 -0.1841411 0.0009339 0.0156051 -0.1914172 0.0016598 -0.0003556 0.0049137 0.1042765 0.342123 0.0328717 -0.0051634 -0.1311285 0.3345611 -0.0001803 -0.004183 -0.0028742 0.0000411 -0.0056546 0.0258088 0.0020077 -0.0706228 -0.1113708 0.0025295 0.0025585 0.0009941 0.1456101 0.0312316 0.2496354 -0.0021832 0.0037999 0.2793636 -0.0018213 -0.0006636 -0.0052663 -0.0148697 0.4202706 -0.3248581 -0.0023858 -0.038647 -0.3960485 0.003751 -0.0041743 0.0078239 0.1223955 -0.9740255 0.0767836 0.0134011 -0.1093669 -0.088263 0.0020559 0.0144309 -0.0004555 -0.0218872 -0.03065 -0.3220113 -0.0002452 -0.0927071 -0.1017393 0.0007502 -0.0016636 0.0041271 -0.1862107 -0.2778684 0.3957255 -0.0008851 0.199508 1.3359576 -0.0120693 0.0002823 -0.0152918 -0.175712 0.0975579 -0.1520378 -0.0012795 0.2253149 -0.3078213 -0.0017156 -0.0036021 0.0036677 -0.055594 -0.348042 0.1414069 0.0015113 0.1946583 -0.0209466 -0.0038322 0.0011889 -0.0030168 -0.1842654 0.1626784 0.0779086 -0.0046144 -0.1112299 0.1962182 -0.0003704 -0.0034733 -0.0031305 -0.1214148 2.390593 -0.1201259 -0.0310456 -0.0464215 1.2285701 -0.0052665 -0.0319335 -0.0043926 0.2201891 0.0283751 0.0115799 0.0610973 -0.0081621 0.0386009 0.0384919 0.0791051 0.0640328 -0.0074342 0.0242567 0.0089309 -0.0621147 -0.0103593 0.0373176 -0.0388256 -0.0798744 -0.0650467 -0.0019686 0.0455189 -0.0073274 0.0320209 0.0167818 -0.0134662 -0.0821386 0.0380069 -0.1377219 -0.0251167 0.0434743 -0.0036854 -0.0339442 0.0187247 -0.0108546 0.0815142 -0.0402237 0.137834 -0.0255889 0.0004902 0.0919909 0.0016829 0.1165838 -0.0343234 -0.0004613 0.0015624 -0.000073 0.1577775 0.1117659 0.066873 0.0002363 0.0447413 0.059844 -0.00006 0.0003729 -0.0004209 0.1572063 0.0703995 -0.0236525 0.001522 -0.0792025 -0.0237297 0.0023298 0.0018912 0.0014239 0.1644683 -0.1285209 -0.0314025 0.0042537 -0.043656 0.0786917 0.0010879 0.0043303 0.0008771 0.1515483 0.2721468 -0.0996553 0.0024836 -0.1976263 0.2285583 0.0039376 0.0030859 0.002547 0.3955252 unknown
polarizability: 229.5826156|-0.4729112|213.532451|-2.3654167|-0.8900989|66.5678098 unknown
InChI: InChI=1S/C13H9BrO2/c14-11-6-10(13(15)16)8-5-4-7-2-1-3-9(11)12(7)8/h1-3,6,15H,4-5H2
charge 0 multiplicity 1
25 atoms
Br 0.594134 3.856545 0.000387
O  -3.876876 0.921162 0.083599
O  -3.474419 -1.36741 0.091545
C  0.76888 -0.39726 0.023598
C  -0.658223 -2.328911 0.05627
C  -0.59314 -0.808499 0.045747
C  0.843891 -2.798143 0.037342
C  1.66181 -1.51014 0.01771
C  1.20913 0.966342 0.008951
C  -1.589658 0.183518 0.054074
C  3.037683 -1.271036 -0.003637
C  0.150312 1.940772 0.018429
C  -1.192296 1.571893 0.040009
C  2.622336 1.184983 -0.012904
C  3.499891 0.087597 -0.018861
C  -3.01966 -0.194006 0.07731
H  -1.203615 -2.695129 0.944404
H  -1.229243 -2.706501 -0.810722
H  1.058833 -3.423683 -0.848976
H  1.084413 -3.41335 0.924317
H  3.763395 -2.091527 -0.009006
H  -1.978429 2.330052 0.046854
H  3.013081 2.206931 -0.02489
H  4.579778 0.274067 -0.035721
H  -4.816404 0.595733 0.099771
