program: Gaussian 09
title: 000283093
version: EM64L-G09RevD.01
frameworkgroup: C1[X(C11H19N3O)]
method: RPBEPBE
basis: SDD
operation: Freq
keyword: #p
keyword: freq=noraman
keyword: PBEPBE/SDD
title: #p freq=noraman PBEPBE/SDD
converged: YES YES NO NO
title: Mulliken charges:
elementType: O N N N C C C C C C C C C C C H H H H H H H H H H H H H H H H H H H
charge: -0.251234 0.030857 -0.400968 -0.652416 -0.420600 -0.493049 -0.409306 0.320728 -0.438549 -0.380848 0.036750 -0.526961 -0.364788 -0.677721 0.294303 0.207237 0.198183 0.227127 0.254030 0.204420 0.202812 0.212895 0.210660 0.197341 0.231885 0.191418 0.232729 0.206440 0.215211 0.201242 0.226970 0.272004 0.298153 0.343046
chargesum: 0.00000
title: Mulliken charges with hydrogens summed into heavy atoms:
elementType: O N N N C C C C C C C C C C C
charge: -0.251234 0.030857 -0.128964 -0.011217 -0.015181 -0.011892 -0.002074 0.320728 -0.014994 -0.183507 0.036750 -0.103658 0.074381 -0.034298 0.294303
polarizability: 2.24412461e+02 1.80787453e+01 1.56377326e+02 -2.72729745e+00 -6.21283539e+00 9.30502213e+01
1716.lowfreq: -10.0866 -6.1412 0.0004 0.0005 0.0007 7.6377 26.8471 36.4220 44.2296
frequency: 26.7719 36.3583 44.1845 60.6446 79.5427 87.1829 116.3642 167.2121 207.4198 220.7613 233.7760 246.9904 262.5855 291.3829 308.1126 348.8989 349.3920 430.8274 441.6930 477.0938 489.8861 501.4250 533.8447 537.8779 606.8477 663.2220 673.7573 709.3343 740.3868 767.1975 794.9238 836.7247 849.6491 868.8060 885.8367 910.5631 925.7401 934.4894 950.1732 999.0609 1039.2517 1049.5574 1063.9259 1077.8790 1088.8527 1092.1994 1104.8111 1132.9012 1139.0229 1174.5231 1213.5407 1238.3535 1256.5948 1270.4761 1278.6927 1289.3851 1302.0120 1317.2943 1334.5184 1336.1297 1343.4871 1347.3609 1382.3019 1392.2224 1450.1858 1456.1583 1468.8477 1469.9165 1474.7042 1475.5193 1478.7472 1487.1570 1519.7841 1548.0778 1601.9850 1642.0902 1681.4878 2939.5502 2951.9426 2972.6331 2975.3836 2976.7654 2983.8067 2984.7686 2997.7457 3030.2493 3038.1109 3043.8495 3052.1586 3055.6777 3071.3244 3076.1243 3104.8376 3401.4539 3537.7018 3696.6897
redmass: 4.3043 3.3154 3.0821 3.9575 4.7809 1.6745 2.8516 3.5242 2.1416 2.7908 1.2348 1.8391 3.7335 1.7777 3.5271 2.2966 2.8727 2.8204 2.1792 1.3253 2.6222 2.6370 3.0703 1.5305 4.2688 5.0865 2.2494 8.5067 1.1588 2.6133 1.3473 1.5927 2.6884 1.4868 1.8156 1.4093 2.6199 2.6702 2.6116 2.8020 2.4630 2.8298 1.7552 1.8447 2.1225 1.9068 1.5619 1.1732 2.4666 1.6570 1.5051 1.3004 1.2646 1.3210 1.1677 2.3606 1.7667 1.3809 1.4595 1.4070 1.5496 1.6540 2.3428 1.2134 1.1050 1.0829 1.4291 1.0945 1.1034 1.0530 1.0575 1.1549 1.2366 6.8448 1.2157 6.0380 5.3870 1.0651 1.0698 1.0360 1.0659 1.0649 1.0632 1.0669 1.0880 1.0941 1.0970 1.1007 1.0935 1.0962 1.1005 1.0993 1.0887 1.0743 1.0459 1.1034
irintensity: 18.4562 0.8384 0.1815 1.5537 6.5488 0.2098 0.2860 0.3029 2.4753 1.3087 0.4109 6.0075 1.0473 13.5337 0.6615 33.8270 0.1177 53.4352 11.1377 208.5997 12.5445 5.6396 12.5340 84.1010 6.6420 2.7650 6.3535 16.8841 4.6466 0.8887 10.8309 6.1319 7.1301 5.7715 7.5177 3.0217 0.7914 8.8638 9.7754 6.5855 34.8029 9.5696 3.5307 2.1585 45.6593 22.8619 13.5387 4.2869 97.1876 6.1671 5.5945 8.7235 4.9859 2.8283 3.7770 475.5873 11.1728 8.9276 3.7227 2.3136 0.5870 7.4677 8.3557 11.5894 1.9773 8.7511 246.2857 24.7140 9.2245 2.8962 46.8397 72.4451 76.5014 58.7049 142.8485 9.2182 302.2756 43.1171 30.8561 42.4413 36.5770 20.9232 19.7948 16.8593 59.7161 4.0226 70.1836 47.2528 6.2353 31.2953 66.3922 44.9194 37.2758 18.5431 50.7533 45.3316
temp: 298.150 k
press: 1.00000 atm
elementType: 8 7 7 7 6 6 6 6 6 6 6 6 6 6 6 1 1 1 1 1 1 1 1 1 1 1 1 1 1 1 1 1 1 1
symmnumber: 1
zpe: 762784.8 jmol-1
zpe.correction: 0.290529 hartree
zpe.thermalcorrener: 0.307117 hartree
zpe.thermalcorrenthalpy: 0.308062 hartree
zpe.thermalcorrgfe: 0.244849 hartree
zpe.sumelectzpe: -668.855025 hartree
zpe.sumelectthermal: -668.838437 hartree
zpe.sumelectthermalent: -668.837493 hartree
zpe.sumelectthermalfe: -668.900706 hartree
dipole: -1.2412 5.6749 -0.6795
dipole: 5.8487
quadrupole: -68.4082 -99.6446 -93.2948
quadrupole: -10.7785 1.7072 0.1496
quadrupole: 18.7077 -12.5288 -6.1789 -10.7785 1.7072 0.1496
hfenergy: -669.1455548 hartree
pointgroup: C01 [X(C11H19N3O1)]
dipole: -0.4269859 1.95853 -1.1298806 debye
polarizability: 223.2594643|5.6435726|138.9673559|-22.6062199|-27.558312|111.613188 unknown
InChI: InChI=1S/C11H19N3O/c1-2-6-10(13-14-11(12)15)9-7-4-3-5-8-9/h7,14H,2-6,8,12H2,1H3
charge 0 multiplicity 1
34 atoms
O  -2.975411 -1.894942 1.750835
N  -0.944199 -0.432876 0.461463
N  -2.275202 -0.07101 0.4072
N  -4.529719 -0.338574 0.973966
C  3.026524 -1.967524 0.656358
C  1.602938 -1.390923 0.81746
C  4.087603 -0.846219 0.695097
C  1.354778 -0.168607 -0.064686
C  3.858658 0.136974 -0.475156
C  2.397957 0.503791 -0.651302
C  -0.051779 0.27257 -0.228544
C  -0.411307 1.479943 -1.089667
C  -0.464769 2.811229 -0.284457
C  -0.862431 4.013441 -1.166443
C  -3.234323 -0.853725 1.097704
H  3.216109 -2.712628 1.452144
H  3.103438 -2.503595 -0.31153
H  1.417807 -1.108596 1.873417
H  0.839364 -2.156942 0.59493
H  5.110206 -1.266175 0.644479
H  4.004966 -0.30162 1.656847
H  4.236715 -0.312216 -1.420144
H  4.4550 1.060648 -0.328295
H  2.200844 1.371924 -1.295113
H  0.317803 1.587106 -1.911239
H  -1.388045 1.320489 -1.596707
H  0.528304 2.989219 0.169901
H  -1.173836 2.711673 0.561388
H  -0.14353 4.152275 -1.995633
H  -1.864609 3.870553 -1.614602
H  -0.886206 4.949913 -0.580185
H  -2.589816 0.736446 -0.147133
H  -4.763157 0.527813 0.493261
H  -5.269073 -0.859435 1.438184
