program: Gaussian 09
title: 000283090
version: EM64L-G09RevD.01
frameworkgroup: C1[X(C15H23NO2)]
method: RPBEPBE
basis: SDD
operation: Freq
keyword: #p
keyword: freq=noraman
keyword: PBEPBE/SDD
title: #p freq=noraman PBEPBE/SDD
converged: NO YES NO NO
title: Mulliken charges:
elementType: O O N C C C C C C C C C C C C C C C H H H H H H H H H H H H H H H H H H H H H H H
charge: -0.454847 -0.271592 -0.429635 0.256653 0.099192 0.357475 -0.462820 -0.550415 0.096816 -0.507108 -0.414422 -0.427140 -0.789291 -0.226811 -0.390824 -0.440744 -0.443404 -0.203557 0.207455 0.208862 0.185672 0.233733 0.300148 0.181171 0.273962 0.243556 0.189503 0.186723 0.262623 0.240771 0.253288 0.208406 0.229918 0.176750 0.206563 0.209892 0.220739 0.347771 0.216174 0.217432 0.201361
chargesum: 0.00000
title: Mulliken charges with hydrogens summed into heavy atoms:
elementType: O O N C C C C C C C C C C C C C C C
charge: -0.107076 -0.271592 -0.129487 0.256653 0.099192 0.357475 -0.046504 -0.131010 0.096816 -0.051975 0.018637 0.022207 -0.086827 0.003107 -0.007511 -0.010113 -0.009798 -0.002196
polarizability: 2.17913067e+02 -3.26721948e+00 1.42035399e+02 -5.75825935e+00 1.85669267e+00 1.40522655e+02
1716.lowfreq: -23.3000 -11.4869 -0.0004 -0.0004 0.0008 5.0779 51.7711 58.8773 83.3520
frequency: 51.6616 58.8186 83.3159 121.1486 153.7898 176.4132 201.6836 231.5887 246.8112 265.3154 271.9816 280.2392 286.0292 310.0098 325.8231 346.0429 360.2129 368.7815 380.5077 418.1257 440.1895 450.1861 465.1384 485.9145 501.2938 550.8776 583.4706 586.4813 620.3446 658.5257 706.9962 716.7809 727.1990 754.9931 788.7127 814.0420 833.6361 843.0493 863.7900 870.7256 916.9110 917.2188 929.2579 937.3644 940.3734 953.0435 975.6081 983.1051 1027.4237 1042.1768 1059.5060 1071.2681 1075.0935 1090.5254 1093.6897 1100.7372 1103.2821 1125.7024 1144.0283 1154.8117 1166.1370 1184.6173 1199.4488 1227.5948 1237.2753 1259.2663 1264.8507 1267.5764 1274.4697 1282.6641 1309.7607 1324.4688 1331.8496 1334.5568 1339.2588 1341.3889 1343.8431 1351.6672 1361.9931 1369.9662 1387.3423 1388.3585 1450.1190 1455.7779 1458.7071 1460.6429 1461.5145 1464.0956 1468.1597 1472.1303 1478.5072 1483.1728 1636.1217 1665.3517 2924.2358 2953.3785 2954.9478 2969.7053 2972.3230 2983.9649 2987.3776 2989.6066 2996.4250 3008.0138 3028.1669 3031.6767 3036.7259 3052.6875 3055.9056 3065.0082 3077.0265 3090.1538 3100.0031 3105.1039 3123.5264 3555.1047 3559.2757
redmass: 3.8468 3.8441 3.9559 3.0143 3.3797 3.0034 3.4302 2.3253 1.8542 2.4525 1.3816 3.3741 2.3116 3.6063 1.1708 2.0834 2.4506 3.1238 2.9842 4.1420 3.1733 3.8620 2.4127 3.3231 1.7674 3.2662 1.4149 3.2642 3.1182 3.1912 2.5127 4.0102 1.8010 2.3680 1.4720 2.0110 2.3152 2.5586 2.3828 2.1272 2.4512 2.0253 2.0715 2.0973 1.5928 2.3839 2.1898 1.2709 2.4847 1.7285 1.9464 2.2632 1.6438 2.4322 1.5655 2.0645 1.6230 1.9017 1.7783 2.3268 1.8761 1.9194 2.0440 1.5378 1.3932 1.7534 1.3635 1.3310 1.2389 1.7155 1.4066 1.9438 1.4233 1.4516 1.4173 1.5196 1.6337 1.4076 1.4261 1.7710 1.4327 1.3694 1.0909 1.0791 1.0814 1.0816 1.0699 1.0832 1.0728 1.0836 1.0847 1.0793 7.7643 6.9847 1.0666 1.0635 1.0644 1.0700 1.0602 1.0408 1.0621 1.0647 1.0768 1.0797 1.0956 1.0933 1.0979 1.1021 1.1011 1.1001 1.0942 1.0839 1.0918 1.0989 1.0973 1.0781 1.0656
irintensity: 0.0272 0.5868 0.6537 1.2706 1.4380 0.0776 1.3177 2.2127 1.4699 5.5560 0.8941 5.9498 1.0613 10.7223 113.3168 1.3745 14.0770 8.7701 6.7669 1.1036 1.6235 11.4709 4.5370 5.6453 2.2835 12.7360 82.3473 11.8560 8.0757 14.4135 6.2452 16.1534 14.3852 20.9216 0.1364 1.9749 3.9730 15.1859 22.1801 6.7105 3.7773 7.6356 17.1466 4.3598 4.6665 10.0515 14.4582 1.0469 16.5721 37.0389 5.2923 12.9829 26.2436 5.3548 2.8966 5.2051 0.7664 4.1472 5.2417 11.3435 15.3274 6.8891 3.5206 7.0299 2.5137 49.9949 15.8324 0.9764 2.6473 18.2652 11.4421 52.0183 7.1479 0.7409 4.6013 14.8007 32.7973 0.1673 1.6687 19.6930 16.5892 29.3407 7.2224 5.0265 20.0483 11.6063 3.6959 6.6161 7.5596 22.7529 16.7010 21.6575 394.2070 3.8311 37.0872 44.3746 42.5374 33.4713 27.0369 20.7669 57.3365 50.6574 13.8298 59.4774 69.3497 44.4639 16.4948 20.1397 61.1432 34.7717 25.1970 11.3474 7.3128 17.2553 35.4698 19.0450 4.7476
temp: 298.150 k
press: 1.00000 atm
elementType: 8 8 7 6 6 6 6 6 6 6 6 6 6 6 6 6 6 6 1 1 1 1 1 1 1 1 1 1 1 1 1 1 1 1 1 1 1 1 1 1 1
symmnumber: 1
zpe: 932876.5 jmol-1
zpe.correction: 0.355314 hartree
zpe.thermalcorrener: 0.372208 hartree
zpe.thermalcorrenthalpy: 0.373152 hartree
zpe.thermalcorrgfe: 0.312817 hartree
zpe.sumelectzpe: -789.200134 hartree
zpe.sumelectthermal: -789.183239 hartree
zpe.sumelectthermalent: -789.182295 hartree
zpe.sumelectthermalfe: -789.242631 hartree
dipole: 2.7348 0.4042 -3.4434
dipole: 4.4158
quadrupole: -105.7423 -106.9340 -113.8303
quadrupole: -5.4244 8.1605 -0.4923
quadrupole: 3.0933 1.9015 -4.9948 -5.4244 8.1605 -0.4923
hfenergy: -789.5554474 hartree
pointgroup: C01 [X(C15H23N1O2)]
dipole: 1.0753595 -0.0841861 -1.3618998 debye
polarizability: 217.9757911|-3.5688164|142.5850991|-5.1503031|1.4110795|139.9102302 unknown
InChI: InChI=1S/C15H23NO2/c1-13(18)14(8-4-2-5-9-14)12(17)16-15(13)10-6-3-7-11-15/h6,10,16,18H,2-5,7-9,11H2,1H3
charge 0 multiplicity 1
41 atoms
O  0.449651 2.107465 -0.331997
O  -1.819368 -0.26003 2.267114
N  0.418567 -0.299444 1.57452
C  -1.150979 0.18205 -0.132433
C  0.297526 0.654656 -0.598943
C  1.319877 -0.042005 0.422282
C  -1.615985 -1.130371 -0.854982
C  -2.225821 1.285726 -0.356329
C  -0.935514 -0.130185 1.36923
C  2.493879 0.867422 0.885463
C  -3.038867 -1.576414 -0.444674
C  -3.669089 0.840241 -0.012254
C  0.603892 0.409279 -2.084035
C  1.880138 -1.366214 -0.099487
C  -4.066808 -0.461911 -0.740868
C  3.651176 0.9166 -0.134189
C  4.250203 -0.490087 -0.371928
C  3.182334 -1.564554 -0.433489
H  -0.896445 -1.950175 -0.670317
H  -1.615701 -0.941077 -1.947407
H  -2.193646 1.586162 -1.428518
H  -1.976552 2.175303 0.251053
H  0.784122 -0.558208 2.492362
H  2.880677 0.448013 1.838339
H  2.107519 1.876423 1.091363
H  -3.060891 -1.815494 0.635001
H  -3.300951 -2.500951 -0.995475
H  -4.368684 1.658254 -0.273933
H  -3.734199 0.678461 1.078488
H  1.574845 0.862447 -2.344912
H  0.65537 -0.662515 -2.331822
H  -0.174976 0.872908 -2.720088
H  1.173409 -2.204793 -0.15642
H  -4.112212 -0.28351 -1.836682
H  -5.078709 -0.779256 -0.424139
H  4.436177 1.605942 0.229942
H  3.282603 1.338842 -1.087229
H  -0.184214 2.595702 -0.915761
H  4.960531 -0.744387 0.444114
H  4.852072 -0.505626 -1.30284
H  3.502544 -2.567388 -0.751323
