program: Gaussian 09
title: 000283097
version: EM64L-G09RevD.01
frameworkgroup: C1[X(C19H13BrO)]
method: RPBEPBE
basis: SDD
operation: Freq
keyword: #p
keyword: freq=noraman
keyword: PBEPBE/SDD
title: #p freq=noraman PBEPBE/SDD
converged: YES YES NO NO
title: Mulliken charges:
elementType: Br O C C C C C C C C C C C C C C C C C C C H H H H H H H H H H H H H
charge: -0.000242 -0.229783 0.131327 -0.188725 -0.520666 -0.556158 0.322811 0.623986 0.217394 -0.435274 -0.438419 -0.406657 -0.433614 -0.190650 -0.000958 0.299291 -0.377425 -0.368485 -0.237805 -0.233982 -0.230926 0.248389 0.271397 0.239561 0.240097 0.250417 0.254830 0.267327 0.243916 0.269900 0.270606 0.232491 0.232691 0.233338
chargesum: 0.00000
title: Mulliken charges with hydrogens summed into heavy atoms:
elementType: Br O C C C C C C C C C C C C C C C C C C C
charge: -0.000242 -0.229783 0.131327 -0.188725 -0.000880 -0.076500 0.322811 0.623986 0.217394 -0.184857 -0.183588 -0.139331 -0.433614 0.053265 -0.000958 0.299291 -0.107525 -0.097879 -0.005314 -0.001291 0.002413
polarizability: 3.54722059e+02 -1.97923040e+01 2.49908867e+02 -1.74432190e+01 -5.51763480e+00 1.14277121e+02
1716.lowfreq: -3.0410 -2.4683 -0.0003 0.0002 0.0003 5.1456 32.5750 44.6455 49.6108
frequency: 32.5332 44.6439 49.5941 92.6563 96.1636 114.2965 134.4304 165.8736 179.0449 224.2625 255.2337 257.0566 264.8195 301.7577 359.4082 404.6843 410.3578 462.8006 471.8329 481.1245 494.8513 521.6488 570.7496 583.8530 591.6384 614.4682 641.8260 642.4827 666.3039 696.5730 703.7109 723.3384 748.5619 796.9188 819.4805 827.6259 833.1266 849.6365 851.9594 864.1869 943.8288 944.8546 957.1876 981.6887 988.3110 991.8848 993.0374 1002.4131 1004.2560 1010.4824 1029.6242 1081.4633 1085.0262 1118.3770 1141.7124 1163.7823 1174.3525 1188.5531 1191.9203 1198.5723 1210.3348 1223.0251 1250.8334 1278.2732 1290.4649 1318.1312 1339.2833 1368.8203 1382.8401 1394.7751 1430.5181 1433.3591 1453.6595 1461.5781 1465.0131 1477.5122 1485.7910 1523.7988 1579.6383 1587.9292 1594.5760 1607.5814 1616.5333 2996.1658 3019.3246 3042.3476 3067.8966 3128.2114 3137.5952 3141.7916 3143.5281 3149.0691 3158.3016 3164.8975 3165.5950 3169.0767
redmass: 5.9565 6.3451 4.8790 4.5485 6.6503 1.8460 7.8739 5.7117 6.3178 3.4752 5.5732 9.9267 5.5118 4.2448 8.7142 2.9973 4.2965 3.5337 4.5206 4.1645 4.2570 6.6554 7.8815 3.1631 5.0717 6.4405 5.9127 4.3155 6.5034 4.3078 2.2376 2.3026 1.8072 2.4418 3.5527 1.8197 3.9485 2.1018 1.7483 1.3268 1.4230 1.4072 3.2578 1.3748 4.5024 1.7133 3.6722 2.0988 1.3448 4.1077 2.1426 2.1688 1.7097 2.5782 1.1857 2.4119 1.0587 1.1480 1.1141 1.5523 1.7711 1.3075 2.0507 3.4197 2.1433 1.3753 2.8724 3.2909 8.6163 2.7959 1.6542 2.0547 1.9620 1.5633 2.7688 2.3161 3.6901 9.7060 7.7277 7.0381 7.1547 6.0850 8.3137 1.0609 1.0633 1.1014 1.0998 1.0850 1.0881 1.0895 1.0872 1.0922 1.0962 1.0958 1.0957 1.1012
irintensity: 2.2757 0.6629 0.5042 0.3881 1.3892 0.1334 0.8899 2.5686 1.9353 8.2438 2.8523 1.8222 1.8017 2.2284 2.9075 0.2029 3.0460 1.7450 2.4122 3.0892 8.9454 2.3848 23.4662 2.4634 1.1301 0.6375 2.3965 4.5601 11.7507 10.6470 55.1714 59.2670 5.9029 9.2516 36.5832 21.7827 39.4040 13.5181 50.2153 10.3666 2.5814 0.7503 1.0363 4.6184 4.6407 8.4488 78.3624 1.2500 1.7695 8.8662 4.7827 14.6688 17.4484 4.3198 0.3505 14.4897 0.2684 21.9155 0.3149 6.1317 4.1994 11.1838 32.4518 307.3746 73.9015 21.0224 34.6829 16.9193 2.5082 24.5777 1.9197 8.9717 6.3230 22.8168 27.5367 6.4184 7.2867 155.2315 38.8983 6.4264 48.2220 27.3110 52.5284 26.9579 10.1966 6.5436 11.5377 0.5588 5.6597 10.0613 3.8318 19.3298 19.0833 10.3912 5.2922 27.5966
temp: 298.150 k
press: 1.00000 atm
elementType: 35 8 6 6 6 6 6 6 6 6 6 6 6 6 6 6 6 6 6 6 6 1 1 1 1 1 1 1 1 1 1 1 1 1
symmnumber: 1
zpe: 677654.1 jmol-1
zpe.correction: 0.258105 hartree
zpe.thermalcorrener: 0.274829 hartree
zpe.thermalcorrenthalpy: 0.275773 hartree
zpe.thermalcorrgfe: 0.211920 hartree
zpe.sumelectzpe: -819.105797 hartree
zpe.sumelectthermal: -819.089073 hartree
zpe.sumelectthermalent: -819.088129 hartree
zpe.sumelectthermalfe: -819.151982 hartree
dipole: 0.3327 -0.0039 1.3262
dipole: 1.3673
quadrupole: -119.8160 -121.0075 -131.7806
quadrupole: -19.7905 -0.5001 1.1051
quadrupole: 4.3854 3.1939 -7.5792 -19.7905 -0.5001 1.1051
hfenergy: -819.363902 hartree
pointgroup: C01 [X(C19H13Br1O1)]
dipole: 0.1278762 -0.1937111 -0.485285 debye
polarizability: 358.1137695|11.2655307|225.9743585|12.489381|-48.6941761|134.8199195 unknown
InChI: InChI=1S/C19H13BrO/c20-17-11-7-12-6-8-14-15(9-10-16(17)18(12)14)19(21)13-4-2-1-3-5-13/h1-5,7,9-11H,6,8H2
charge 0 multiplicity 1
34 atoms
Br -4.284232 2.760023 -0.94076
O  2.041711 -1.647513 1.294946
C  -0.634276 -1.108329 0.344927
C  -1.958126 -0.65799 0.074543
C  -0.681522 -2.588041 0.704973
C  -2.185775 -3.008335 0.514318
C  -2.913124 -1.713721 0.169241
C  -2.284502 0.698397 -0.25379
C  0.434886 -0.19621 0.249798
C  -4.258428 -1.42295 -0.063439
C  -1.189031 1.623978 -0.300559
C  0.115087 1.179527 -0.064723
C  -3.677617 0.944942 -0.482168
C  -4.63307 -0.075968 -0.389885
C  1.835214 -0.641059 0.539413
C  3.01087 0.078868 -0.065641
C  2.95337 0.709104 -1.338468
C  4.247929 0.041743 0.633249
C  4.109858 1.30015 -1.893111
C  5.39656 0.647234 0.0869
C  5.3303 1.279637 -1.178869
H  0.011995 -3.1850 0.085546
H  -0.339247 -2.73159 1.744678
H  -2.59406 -3.477419 1.428313
H  -2.295214 -3.751588 -0.298129
H  -5.035854 -2.19183 -0.005473
H  -1.380543 2.679362 -0.517468
H  0.931898 1.908014 -0.085709
H  -5.686824 0.156816 -0.571914
H  2.018011 0.707983 -1.90794
H  4.283834 -0.474603 1.598277
H  4.060462 1.770728 -2.881188
H  6.342525 0.62448 0.638861
H  6.224735 1.74546 -1.607644
