program: Gaussian 09
title: 000283075
version: EM64L-G09RevD.01
frameworkgroup: C1[X(C17H17NO)]
method: RPBEPBE
basis: SDD
operation: Freq
keyword: #p
keyword: freq=noraman
keyword: PBEPBE/SDD
title: #p freq=noraman PBEPBE/SDD
converged: YES YES NO NO
title: Mulliken charges:
elementType: O N C C C C C C C C C C C C C C C C C H H H H H H H H H H H H H H H H H
charge: -0.245982 -0.394444 0.140133 -0.135528 0.114745 -0.472644 -0.279889 -0.467186 -0.670446 -0.083861 0.099141 -0.405601 -0.407856 0.473072 0.387872 -0.440731 -0.504752 -0.419352 -0.201951 0.231881 0.216574 0.213011 0.253705 0.248345 0.191044 0.233139 0.224042 0.196217 0.234223 0.207609 0.195203 0.314752 0.252310 0.240034 0.244779 0.218388
chargesum: 0.00000
title: Mulliken charges with hydrogens summed into heavy atoms:
elementType: O N C C C C C C C C C C C C C C C C C
charge: -0.245982 -0.079692 0.140133 0.096353 0.114745 -0.043059 -0.026183 -0.027797 -0.213265 -0.083861 0.099141 0.024840 -0.005044 0.473072 0.387872 -0.188421 -0.264718 -0.174573 0.016437
polarizability: 2.48611654e+02 4.91663098e+00 1.99623681e+02 3.81788979e+00 5.92425628e+00 1.18975176e+02
1716.lowfreq: -0.0007 -0.0005 -0.0004 6.0054 11.6323 20.0524 70.9712 96.3696 135.8609
frequency: 70.9326 96.3542 135.8441 148.4424 155.3030 219.0142 226.8834 250.2403 267.8241 279.9909 333.7199 358.3922 375.3563 407.8272 437.9823 462.7173 484.0556 512.7339 522.5487 551.9576 562.7709 583.3421 596.2128 608.5980 656.4023 660.7126 693.5079 707.5536 746.7277 766.0692 789.5443 799.7565 814.3296 834.4774 838.5310 855.5589 883.1998 900.9795 914.1433 930.6147 952.3053 974.3694 978.2434 988.1812 1013.4947 1026.8874 1032.8332 1054.2929 1068.0303 1073.6792 1112.1017 1121.4340 1128.7406 1159.4878 1173.1842 1173.9172 1181.4512 1199.8947 1211.4770 1231.6134 1244.0618 1256.7016 1265.2643 1268.1424 1291.5850 1316.2275 1325.8061 1335.1303 1338.3846 1341.6875 1351.7073 1358.9679 1362.6009 1380.4025 1448.6209 1459.1212 1460.3470 1465.0003 1471.2416 1477.0428 1518.5399 1527.6958 1596.4914 1634.6964 1660.7376 2942.3995 2964.1334 2966.7929 2969.4309 2976.1910 2983.7113 2987.6141 3024.7737 3028.9571 3038.7363 3043.0333 3053.3103 3120.3249 3136.2613 3155.6216 3178.2729 3554.3826
redmass: 6.0331 3.7214 3.4472 3.8101 4.7121 2.9334 3.8518 3.6448 2.6237 3.4118 3.4263 2.1814 4.5560 2.6220 3.8495 4.0321 2.7990 3.7156 3.2849 3.6525 1.6425 2.4747 2.8430 4.1601 3.2332 4.0945 2.4455 5.0856 1.8841 3.8411 1.9675 2.0977 3.3540 2.3507 3.7564 2.3823 1.7172 1.9300 2.1039 2.5524 2.5083 1.8909 1.5127 2.3662 2.1375 3.6561 2.1687 2.4833 1.8361 1.9696 1.7537 2.7838 1.7125 1.4667 1.4385 1.3318 2.3700 1.6356 1.6765 1.4807 1.7930 1.5820 1.6229 1.4249 2.0465 1.4323 1.3072 1.4377 2.4479 1.4217 1.4347 1.7850 1.4100 1.8516 1.2601 1.1083 1.6896 1.5515 1.0891 1.0924 7.7986 5.6234 6.9505 8.4167 9.8195 1.0807 1.0717 1.0627 1.0613 1.0642 1.0717 1.0631 1.1008 1.0965 1.1016 1.0982 1.1030 1.0863 1.0913 1.0984 1.0954 1.0787
irintensity: 1.2162 1.7123 0.1729 0.8028 3.7705 4.1417 0.7083 1.3224 4.7961 0.4593 3.0447 1.2997 0.0979 0.9836 1.1435 4.2875 4.1929 3.8241 3.2755 9.2767 62.1905 38.9434 6.2148 6.0356 4.6219 5.6792 2.6940 10.9176 5.0946 39.9084 1.6431 28.2054 47.7450 20.6971 3.0349 9.5653 5.8509 8.3926 4.2035 2.3612 5.8770 2.6588 1.6852 2.5300 3.7496 1.1265 4.4854 9.2774 1.3010 4.1152 10.3580 0.1709 23.5453 0.8956 0.5397 7.0700 1.8475 3.4599 5.9927 8.5951 10.2108 10.6385 6.6406 1.5318 15.0124 0.2610 2.2817 0.1872 4.2897 0.8136 0.2488 4.9861 0.7460 0.2438 8.6093 9.7110 0.5737 3.4560 31.4927 15.7515 35.6023 6.2928 7.3231 273.7025 30.5735 18.0214 2.2366 19.8656 23.6358 56.5193 45.3899 36.9080 42.3723 50.4676 23.4411 29.6199 48.1565 8.7747 16.1661 42.2328 6.0297 29.3049
temp: 298.150 k
press: 1.00000 atm
elementType: 8 7 6 6 6 6 6 6 6 6 6 6 6 6 6 6 6 6 6 1 1 1 1 1 1 1 1 1 1 1 1 1 1 1 1 1
symmnumber: 1
zpe: 781023.4 jmol-1
zpe.correction: 0.297476 hartree
zpe.thermalcorrener: 0.311704 hartree
zpe.thermalcorrenthalpy: 0.312648 hartree
zpe.thermalcorrgfe: 0.257738 hartree
zpe.sumelectzpe: -786.606888 hartree
zpe.sumelectthermal: -786.592660 hartree
zpe.sumelectthermalent: -786.591716 hartree
zpe.sumelectthermalfe: -786.646626 hartree
dipole: -2.0308 -0.3570 1.5139
dipole: 2.5580
quadrupole: -111.2867 -99.2346 -117.0352
quadrupole: -6.2391 7.6462 5.2482
quadrupole: -2.1012 9.9509 -7.8497 -6.2391 7.6462 5.2482
hfenergy: -786.904364 hartree
pointgroup: C01 [X(C17H17N1O1)]
dipole: 0.8107966 0.1332281 0.5811138 debye
polarizability: 248.5493929|4.1985569|199.4621148|-6.1485989|-6.2828819|119.1990039 unknown
InChI: InChI=1S/C17H17NO/c19-16-17-7-2-1-6-12(17)8-10-4-3-5-11-9-13(18-16)15(17)14(10)11/h3-5,9,12-13,18H,1-2,6-8H2
charge 0 multiplicity 1
36 atoms
O  -2.381962 -1.748699 -1.462617
N  -0.383563 -2.493442 -0.467071
C  -1.14156 -0.301455 0.21877
C  -1.097807 1.03191 -0.633268
C  0.251307 -0.633637 0.666585
C  -2.176786 -0.23654 1.392699
C  0.641186 -2.099953 0.540525
C  -2.509785 1.595659 -0.934039
C  -0.127938 2.089878 0.021586
C  1.351415 0.134151 0.385609
C  -1.412626 -1.566372 -0.677636
C  -3.562978 0.285333 0.959883
C  -3.428104 1.67874 0.306823
C  1.29108 1.536474 0.056726
C  2.538773 -0.715583 0.159621
C  2.134098 -2.050323 0.178472
C  2.488791 2.136717 -0.29521
C  3.781996 -0.01717 -0.121427
C  3.730583 1.35769 -0.323278
H  -0.635336 0.766027 -1.60679
H  -1.760516 0.437366 2.168714
H  -2.259444 -1.238052 1.858458
H  0.5226 -2.699049 1.470471
H  -2.992932 0.9288 -1.674144
H  -2.408617 2.591418 -1.410183
H  -0.474177 2.330226 1.047707
H  -0.171171 3.028149 -0.562265
H  -4.229369 0.330695 1.842914
H  -4.018334 -0.416295 0.234982
H  -4.422382 2.05963 0.004689
H  -3.021174 2.399052 1.046742
H  -0.388796 -3.397882 -0.942906
H  2.775054 -2.933576 0.119296
H  2.52807 3.19337 -0.585321
H  4.728971 -0.559985 -0.211043
H  4.657336 1.893827 -0.562177
