program: Gaussian 09
title: 000003715
version: EM64L-G09RevD.01
frameworkgroup: C1[X(C19H16ClNO4)]
method: RPBEPBE
basis: SDD
operation: Freq
keyword: #p
keyword: freq=noraman
keyword: PBEPBE/SDD
title: #p freq=noraman PBEPBE/SDD
converged: YES YES NO NO
title: Mulliken charges:
elementType: Cl O O O O N C C C C C C C C C C C C C C C C C C C H H H H H H H H H H H H H H H H
charge: -0.038621 -0.268172 -0.211009 -0.409751 -0.225608 -0.296830 0.153641 0.177706 0.206194 0.234845 -0.629781 -0.555451 -0.270041 -0.772011 0.045729 0.330124 -0.385308 0.270704 0.203722 -0.342058 -0.317650 -0.210412 -0.215100 -0.109403 -0.537834 0.253611 0.242233 0.280789 0.256556 0.237826 0.247056 0.267151 0.241661 0.274219 0.284241 0.261893 0.263047 0.219048 0.219781 0.244991 0.378271
chargesum: 0.00000
title: Mulliken charges with hydrogens summed into heavy atoms:
elementType: Cl O O O O N C C C C C C C C C C C C C C C C C C C
charge: -0.038621 -0.268172 -0.211009 -0.031480 -0.225608 -0.296830 0.153641 0.177706 0.206194 0.234845 -0.133937 -0.274662 -0.013485 -0.019978 0.045729 0.330124 -0.143647 0.270704 0.203722 -0.067838 -0.033409 0.051481 0.047947 -0.109403 0.145985
polarizability: 3.29927137e+02 4.41552779e+00 2.70499490e+02 5.20457082e+00 2.30091697e+01 1.61768056e+02
1716.lowfreq: -5.4111 -2.1998 -0.0017 -0.0016 -0.0011 4.6564 14.9885 22.7985 30.0650
frequency: 14.9469 22.7633 30.0615 36.0844 50.9537 69.3104 73.9710 85.3261 109.9252 125.9671 132.5953 140.9643 170.6007 181.9372 202.1108 219.0468 242.7788 262.5599 266.2026 292.6000 311.6884 327.3877 360.9492 387.6047 399.5845 409.6490 411.4032 429.0976 443.2022 469.5079 487.1152 515.5411 535.1680 562.8830 582.2351 609.1791 614.2160 622.5546 639.2641 658.9175 682.2071 692.4521 716.9262 735.5306 744.9037 756.6734 790.1059 818.7719 832.8439 843.0876 848.0445 876.7412 887.9628 908.9865 921.7113 950.8939 965.9845 976.1341 996.5490 1001.5485 1007.0193 1045.0149 1051.5654 1070.8775 1087.4828 1111.2925 1112.3903 1134.1768 1148.8163 1162.6096 1184.5829 1190.3892 1202.1523 1230.3313 1258.3803 1275.4657 1287.3441 1294.6059 1315.3319 1318.7463 1365.4688 1369.7970 1395.6165 1404.9535 1415.9761 1434.8148 1449.1722 1449.8695 1463.9449 1467.6260 1468.3380 1473.1525 1474.7909 1481.8837 1558.3905 1582.5970 1585.3113 1594.8855 1613.1440 1632.8387 1665.8331 2956.9966 2996.9942 3029.7637 3043.3525 3075.0922 3095.5697 3107.3759 3122.9939 3155.5367 3156.3534 3159.7602 3168.5547 3174.9568 3178.2634 3181.2920 3506.4904
redmass: 7.3777 10.3344 8.3220 8.3942 3.9481 4.6073 4.3340 6.8562 3.9441 4.5343 1.3373 3.0544 4.5449 5.1362 6.3363 2.4893 2.4463 2.0620 5.8266 4.1218 4.5697 7.3735 4.9773 5.9661 5.6602 2.6404 2.6287 4.0803 4.1103 4.3211 4.5210 3.8008 4.6473 3.5968 4.7546 3.2135 4.1096 6.0937 2.3243 2.9192 5.0102 4.8916 6.1484 5.1949 3.7206 4.9010 1.4689 4.5248 1.3136 2.3012 2.6766 1.7092 3.0043 3.9359 1.3444 2.6662 1.4606 1.3801 3.6108 3.7871 2.6168 1.5441 2.3381 2.9487 2.1325 1.3576 1.2590 1.7568 2.0652 1.5718 1.1303 1.3639 3.3546 2.3567 4.5870 1.5756 1.4639 1.2596 2.5510 3.7220 4.3072 5.4558 3.8379 3.0758 1.6386 1.2659 1.0725 1.1326 2.8480 1.2803 1.2994 1.9886 1.2011 1.6658 9.1229 7.7018 7.4136 6.2420 7.8085 7.7066 8.5647 1.0331 1.0376 1.0591 1.1038 1.0964 1.1032 1.0995 1.0991 1.0888 1.0891 1.0874 1.0926 1.0967 1.0978 1.0957 1.0639
irintensity: 0.6774 0.2060 0.0035 1.4591 0.1442 2.9216 1.4822 9.0991 0.8612 0.4890 0.3691 1.8500 0.6986 1.5947 3.5007 1.3517 0.4240 5.2886 4.0628 0.1709 0.9217 0.0734 1.7724 14.6353 1.3271 0.7618 0.6803 2.2233 8.2115 31.8287 9.5620 22.2320 20.8671 35.3174 5.7987 34.2553 18.4427 4.8308 69.9602 45.0848 31.3002 17.4821 6.1195 5.6990 28.7654 0.8069 37.2624 15.2945 5.1148 21.5918 37.8496 34.2558 17.0278 52.8881 2.9209 21.6484 3.5803 3.6067 10.1797 57.7960 72.3729 20.4015 221.0355 70.9218 34.2137 13.7029 0.2784 13.5032 36.3313 2.7104 18.3114 14.3334 137.7991 128.4893 44.8334 41.5564 11.1426 2.7751 75.9089 542.3988 65.3666 2.7635 14.6404 29.2165 38.4905 42.3928 28.3805 15.2857 174.8738 34.6826 42.2099 40.6083 5.1033 4.7161 133.0916 17.0557 81.9376 102.7799 97.9235 46.8061 230.5078 73.8354 14.9280 16.6823 49.5506 9.2811 3.1170 15.9837 28.1209 2.1445 0.2980 5.8511 0.8277 3.3516 0.6115 7.9132 20.4541
temp: 298.150 k
press: 1.00000 atm
elementType: 17 8 8 8 8 7 6 6 6 6 6 6 6 6 6 6 6 6 6 6 6 6 6 6 6 1 1 1 1 1 1 1 1 1 1 1 1 1 1 1 1
symmnumber: 1
zpe: 803903.9 jmol-1
zpe.correction: 0.306191 hartree
zpe.thermalcorrener: 0.329434 hartree
zpe.thermalcorrenthalpy: 0.330379 hartree
zpe.thermalcorrgfe: 0.250409 hartree
zpe.sumelectzpe: -1547.571600 hartree
zpe.sumelectthermal: -1547.548356 hartree
zpe.sumelectthermalent: -1547.547412 hartree
zpe.sumelectthermalfe: -1547.627381 hartree
dipole: 0.0597 3.3627 0.0794
dipole: 3.3642
quadrupole: -151.0601 -145.6867 -151.3290
quadrupole: -0.9085 4.1529 1.8770
quadrupole: -1.7015 3.6719 -1.9704 -0.9085 4.1529 1.8770
hfenergy: -1547.8777905 hartree
pointgroup: C01 [X(C19H16Cl1N1O4)]
dipole: -0.09364 -1.312538 -0.1424466 debye
polarizability: 328.5685958|-11.1477498|267.3575173|4.1078825|31.4476613|166.2685697 unknown
InChI: InChI=1S/C19H16ClNO4/c1-11-15(10-18(22)23)16-9-14(25-2)7-8-17(16)21(11)19(24)12-3-5-13(20)6-4-12/h3-9,22H,10H2,1-2H3
charge 0 multiplicity 1
41 atoms
Cl -6.378663 -0.058652 -1.737896
O  2.039745 -4.147433 -0.028351
O  -1.26225 2.654951 1.835993
O  4.791984 0.032096 -1.528033
O  4.081719 2.228481 -1.802053
N  0.035286 1.04454 0.735211
C  2.30734 0.811645 0.502033
C  1.70453 -0.50876 0.377739
C  0.288578 -0.354376 0.536058
C  1.293799 1.735402 0.732452
C  3.786631 1.106065 0.39063
C  2.265952 -1.787314 0.179715
C  -0.561717 -1.474212 0.566765
C  1.39274 3.226134 0.876911
C  -1.2091 1.664626 1.050739
C  1.405614 -2.908173 0.176197
C  0.004179 -2.756179 0.379962
C  -2.441014 1.152118 0.369253
C  4.218582 1.227507 -1.067256
C  -3.684998 1.304639 1.034935
C  -2.415769 0.646928 -0.957552
C  -4.888314 0.928741 0.405438
C  -3.61395 0.284132 -1.606714
C  -4.831396 0.42203 -0.909506
C  1.203748 -5.348197 -0.023968
H  4.370577 0.302443 0.869695
H  4.031028 2.059289 0.887537
H  3.33926 -1.931589 0.028359
H  -1.637798 -1.383976 0.730321
H  2.40753 3.559602 0.607005
H  0.682624 3.746716 0.209384
H  1.155236 3.555152 1.902814
H  -0.655987 -3.627638 0.398543
H  -3.695446 1.730402 2.043263
H  -1.464604 0.547823 -1.489287
H  -5.848229 1.03305 0.918671
H  -3.602471 -0.093876 -2.632648
H  0.447092 -5.319002 -0.832641
H  0.6977 -5.486397 0.951734
H  1.899262 -6.182098 -0.199794
H  5.021172 0.123455 -2.493157
