program: Gaussian 09
title: 000283088
version: EM64L-G09RevD.01
frameworkgroup: C1[X(C16H26N2O4)]
method: RPBEPBE
basis: SDD
operation: Freq
keyword: #p
keyword: freq=noraman
keyword: PBEPBE/SDD
title: #p freq=noraman PBEPBE/SDD
converged: YES YES NO NO
title: Mulliken charges:
elementType: O O O O N N C C C C C C C C C C C C C C C C H H H H H H H H H H H H H H H H H H H H H H H H H H
charge: -0.434691 -0.284367 -0.281800 -0.433180 -0.142641 -0.045273 0.336019 0.239916 -0.553596 -0.013376 -0.494736 -0.470803 -0.463734 -0.476003 -0.513395 0.003984 -0.239936 -0.467615 -0.009120 -0.239510 -0.508266 -0.512678 0.217019 0.237716 0.266552 0.192834 0.215380 0.269535 0.208932 0.214554 0.197631 0.223400 0.258661 0.207499 0.191937 0.242554 0.249762 0.201917 0.183856 0.228935 0.362692 0.196238 0.233074 0.202149 0.368716 0.193285 0.207096 0.232874
chargesum: 0.00000
title: Mulliken charges with hydrogens summed into heavy atoms:
elementType: O O O O N N C C C C C C C C C C C C C C C C
charge: -0.071999 -0.284367 -0.281800 -0.064465 -0.142641 -0.045273 0.336019 0.239916 -0.098860 -0.013376 -0.035350 0.014112 -0.040248 -0.054971 -0.047235 0.195921 0.002618 -0.015935 0.174737 -0.010575 0.123194 0.120577
polarizability: 2.49538545e+02 1.35848968e+00 1.86642579e+02 -8.10051047e-01 2.61467386e+00 1.58553691e+02
1716.lowfreq: -6.4004 -0.0011 -0.0007 -0.0006 5.9888 13.7815 28.7723 34.7573 51.3339
frequency: 28.5159 34.2452 51.2819 78.7186 86.1621 96.0284 122.4728 131.5131 143.7425 162.2725 178.9735 189.3554 191.6430 206.1742 224.8618 237.4135 249.6555 264.8120 282.8322 302.7775 317.7206 338.8924 346.8421 355.0920 372.7324 379.6786 394.4368 422.6455 429.2451 440.3150 463.1236 485.1350 500.3263 510.0732 542.8892 554.1511 625.6078 640.3122 658.2577 661.8569 706.7738 746.6969 773.8645 775.3289 809.1969 836.5986 845.0655 865.7764 883.3795 900.9277 905.0898 930.3089 948.1245 953.4107 971.2469 977.6082 980.1936 987.8161 994.1718 1015.6870 1035.6214 1051.4379 1055.5147 1065.7637 1079.6388 1084.5136 1098.4414 1112.4743 1114.2652 1124.2564 1132.1356 1138.0425 1150.9927 1157.2258 1169.0234 1173.8270 1180.4931 1201.4986 1219.7387 1233.7552 1245.4022 1255.9315 1267.9160 1283.0572 1290.4591 1303.2592 1315.7106 1319.6838 1322.0839 1322.3898 1330.3873 1334.8096 1342.8011 1346.9969 1356.0832 1361.2236 1380.6201 1431.6094 1434.4470 1452.9805 1457.2465 1459.4238 1461.6923 1469.1752 1469.8354 1471.3021 1473.9322 1478.0671 1482.5157 1494.4334 1616.4233 1675.9406 2874.5839 2914.8569 2923.7617 2925.2662 2948.4155 2978.4916 2988.3227 2988.6338 2994.2779 2995.9583 2998.6319 3006.3626 3008.5881 3030.8883 3048.0325 3049.2537 3059.5910 3073.2275 3076.6963 3085.8796 3094.7061 3096.3277 3113.4137 3144.3443 3553.8026 3560.7594
redmass: 4.4427 5.1311 3.8134 3.0839 2.7324 2.9569 4.2397 3.3284 3.2308 2.9609 2.8037 2.4038 2.6271 2.4974 2.0427 2.5464 3.0274 2.3199 1.9026 1.7929 1.9997 3.1436 3.1219 2.5702 3.2881 3.1608 2.4822 2.1346 1.5506 2.4124 3.2487 3.1757 3.5744 4.1326 3.9832 4.0275 4.3196 3.3115 3.4899 4.8297 3.0284 1.7152 2.2012 1.9804 3.1896 2.3908 3.7012 3.3685 5.3311 2.7284 3.1875 2.7078 2.3552 2.1281 2.0618 1.4079 3.0598 2.0147 1.9902 3.6589 5.0549 5.1946 2.2403 2.3862 2.2187 1.4841 2.0824 1.3479 1.3527 1.5695 2.5320 2.5828 1.4011 1.3936 1.2014 1.9269 1.3730 1.7079 1.2923 1.6665 1.3082 1.5502 1.3007 1.4933 1.3300 1.3115 1.3359 1.3379 1.4482 1.4094 1.5644 1.4808 1.6140 1.3915 1.3441 1.4943 1.6692 1.1320 1.1351 1.0717 1.0613 1.0753 1.0808 1.0858 1.0853 1.0693 1.0810 1.0539 1.0634 1.0856 8.5649 8.0420 1.0809 1.0806 1.0369 1.0362 1.0688 1.0621 1.0596 1.0634 1.0662 1.0629 1.1006 1.0965 1.0641 1.0982 1.1021 1.0982 1.1025 1.0933 1.0965 1.0997 1.0969 1.0974 1.0846 1.0988 1.0679 1.0676
irintensity: 0.1932 0.0828 0.2114 1.5527 4.5805 3.8844 0.7383 1.2073 1.9576 0.1375 1.6480 0.2935 1.5426 0.3856 5.6947 1.4576 7.2352 15.0551 71.7151 40.7226 11.3273 3.8678 12.6482 9.1821 0.8313 1.3527 6.8947 17.4956 55.7658 20.1485 20.3581 7.5532 2.4335 11.2908 4.7333 0.6840 3.9693 2.7666 0.9220 0.3818 3.2550 3.5953 38.2266 33.8289 4.0066 66.7590 79.9759 1.7365 9.7624 2.4420 9.7691 1.6000 5.7747 16.5116 5.7707 4.3918 30.5882 10.1570 13.9323 7.9373 83.1774 139.7884 22.3064 9.0377 4.7317 0.3765 9.2731 2.5905 2.7345 7.3368 6.6398 14.1718 17.1281 14.9900 5.2062 5.6967 12.0455 3.0063 2.1084 2.0701 3.1268 13.5893 30.0286 42.8409 14.6082 6.9791 2.6340 1.2079 10.8711 7.5571 12.9928 18.2562 8.4193 0.2035 9.4999 2.0180 21.7708 3.3492 3.9487 4.4413 10.7335 17.1471 12.9149 3.0048 9.4869 17.0577 6.2009 15.7326 4.3598 2.8683 1.9117 1.7422 56.3189 58.2476 109.8609 84.3211 35.0348 28.1851 43.0031 46.7519 32.3822 43.0324 69.7084 74.6693 22.6155 45.8886 22.9620 33.6718 33.2275 23.3621 19.0723 14.4832 28.7983 36.3856 2.2974 20.7352 24.7802 37.0749
temp: 298.150 k
press: 1.00000 atm
elementType: 8 8 8 8 7 7 6 6 6 6 6 6 6 6 6 6 6 6 6 6 6 6 1 1 1 1 1 1 1 1 1 1 1 1 1 1 1 1 1 1 1 1 1 1 1 1 1 1
symmnumber: 1
zpe: 1060666.7 jmol-1
zpe.correction: 0.403987 hartree
zpe.thermalcorrener: 0.426530 hartree
zpe.thermalcorrenthalpy: 0.427475 hartree
zpe.thermalcorrgfe: 0.353344 hartree
zpe.sumelectzpe: -1033.808194 hartree
zpe.sumelectthermal: -1033.785650 hartree
zpe.sumelectthermalent: -1033.784706 hartree
zpe.sumelectthermalfe: -1033.858837 hartree
dipole: 1.1915 0.4620 2.5751
dipole: 2.8748
quadrupole: -121.8869 -124.4523 -129.7913
quadrupole: -2.2881 -0.6885 -5.8715
quadrupole: 3.4900 0.9245 -4.4145 -2.2881 -0.6885 -5.8715
hfenergy: -1034.2121808 hartree
pointgroup: C01 [X(C16H26N2O4)]
dipole: -0.4777075 -0.2082643 1.0038 debye
polarizability: 249.5134955|1.4057658|186.7611657|1.6714006|-1.872125|158.4601536 unknown
InChI: InChI=1S/C16H26N2O4/c1-21-12-3-7-15(8-4-12)11-18(20)16(14(15)17-19)9-5-13(22-2)6-10-16/h5,9,12-13,19-20H,3-4,6-8,10-11H2,1-2H3
charge 0 multiplicity 1
48 atoms
O  1.155911 -3.084491 0.359082
O  -4.680216 1.070926 -0.294387
O  5.069051 1.249011 -0.154485
O  -0.863532 2.345459 -1.070991
N  0.413706 -1.974155 -0.31731
N  0.331742 1.4843 -0.948696
C  -1.299237 -0.327352 -0.045259
C  1.212379 -0.672889 -0.230609
C  -0.845812 -1.737607 0.448479
C  0.042713 0.30451 -0.460609
C  -2.004569 0.486764 1.082116
C  -2.256624 -0.432677 -1.279975
C  -3.362148 -0.138935 1.472327
C  -3.639962 -1.013622 -0.901765
C  1.861818 -0.430433 1.169575
C  -4.3112 -0.251154 0.254942
C  2.255905 -0.668218 -1.329566
C  2.957857 0.655596 1.100044
C  4.098313 0.18397 0.173603
C  3.547485 -0.299868 -1.150092
C  -5.545841 1.856019 0.579748
C  5.88274 1.658946 0.987881
H  -0.661806 -1.743155 1.544722
H  -1.562951 -2.539443 0.213526
H  -2.16771 1.51495 0.716692
H  -1.347115 0.545919 1.971497
H  -1.784224 -1.065934 -2.054378
H  -2.393988 0.57797 -1.699678
H  -3.83403 0.460992 2.274296
H  -3.217506 -1.156042 1.890557
H  -3.553424 -2.079115 -0.60954
H  -4.307347 -0.973697 -1.782353
H  2.2933 -1.394274 1.501624
H  1.092473 -0.140389 1.909156
H  -5.246008 -0.776558 0.560755
H  1.89701 -0.99551 -2.313649
H  2.540956 1.594167 0.688627
H  3.336504 0.863316 2.118869
H  4.655809 -0.647423 0.673666
H  4.262658 -0.321727 -1.981693
H  1.438232 -3.648501 -0.406858
H  -6.446683 1.279225 0.884164
H  -5.857162 2.733306 -0.010033
H  -5.022318 2.205803 1.493944
H  -0.475215 3.163994 -1.474185
H  6.376424 0.786077 1.469402
H  5.290404 2.200303 1.753678
H  6.652339 2.336347 0.584244
