program: Gaussian 09
title: 000283063
version: EM64L-G09RevD.01
frameworkgroup: C1[X(C15H21NO3)]
method: RPBEPBE
basis: SDD
operation: Freq
keyword: #p
keyword: freq=noraman
keyword: PBEPBE/SDD
title: #p freq=noraman PBEPBE/SDD
converged: YES YES NO NO
title: Mulliken charges:
elementType: O O O N C C C C C C C C C C C C C C C H H H H H H H H H H H H H H H H H H H H H
charge: -0.215571 -0.139260 -0.256701 -0.171468 0.133286 0.252576 -0.453947 -0.455815 0.006223 0.114205 -0.466336 -0.412282 -0.412843 -0.395001 -0.219231 -0.441690 -0.443223 -0.178618 -0.505659 0.233176 0.207399 0.201620 0.231267 0.221810 0.236261 0.196046 0.248501 0.245011 0.195215 0.206953 0.186910 0.229309 0.244718 0.210934 0.219594 0.222466 0.204097 0.228848 0.225691 0.265530
chargesum: 0.00000
title: Mulliken charges with hydrogens summed into heavy atoms:
elementType: O O O N C C C C C C C C C C C C C C C
charge: -0.215571 -0.139260 -0.256701 -0.171468 0.133286 0.252576 -0.013372 -0.022927 0.006223 0.114205 -0.008265 0.032266 0.027383 -0.001139 0.010078 0.013961 -0.001163 0.025479 0.214410
polarizability: 2.24006163e+02 -4.66551733e+00 1.54072561e+02 1.91782451e+00 2.50661544e-01 1.38377075e+02
1716.lowfreq: -5.8833 -0.0005 0.0004 0.0007 13.4927 16.2954 36.1459 52.3370 59.1028
frequency: 30.4760 52.3200 59.0489 78.4481 94.8959 112.6070 146.2446 153.3333 188.2863 204.2177 220.1263 231.2487 243.4941 254.8319 276.5974 287.2540 312.5742 337.7074 354.4443 392.8227 419.9236 435.3882 453.4415 472.4796 497.1276 533.8742 554.4036 590.2881 660.5852 693.6221 697.6127 727.6062 769.4810 779.3831 788.7326 818.6983 841.5919 854.3228 870.9413 884.3672 904.8370 921.1681 936.3761 939.6294 952.9962 963.7983 976.9807 984.6510 1020.1647 1050.2023 1055.8268 1070.6161 1087.7607 1102.2731 1102.6618 1103.1819 1122.8805 1144.6968 1153.7654 1162.4018 1169.2855 1178.0570 1187.5516 1219.3079 1238.9181 1259.2646 1264.2602 1266.0334 1270.9586 1298.5546 1316.0385 1329.1793 1337.8364 1338.7908 1342.3121 1345.6348 1351.8415 1359.9733 1382.2417 1408.8702 1442.3683 1449.3551 1457.1349 1459.8730 1460.9413 1463.4231 1470.7366 1471.4675 1476.1514 1479.6859 1611.6010 1662.5421 1670.5704 2956.4262 2964.3029 2973.3247 2975.3431 2985.9993 2988.3903 2990.1077 2992.2715 3002.6541 3018.0645 3031.3095 3032.6890 3035.1765 3053.3358 3054.6704 3062.2125 3071.2056 3094.3357 3098.4220 3125.6965 3127.4018
redmass: 4.9183 4.9222 3.2049 3.1870 3.3826 3.1297 3.7671 4.3240 1.3564 2.7077 4.1399 2.3565 2.3581 2.4992 2.6321 5.8594 5.4349 3.1282 1.8236 4.7442 2.7181 3.1750 2.9001 4.1961 2.0401 6.4467 3.3889 4.1934 1.9304 7.3288 4.4487 2.0243 2.9113 3.5939 1.5072 2.1462 3.0795 2.3953 1.9538 2.9673 2.6298 3.1408 2.1733 1.5287 2.2789 2.3005 1.3560 3.1010 3.9667 2.2537 2.0219 2.4421 1.7565 1.6854 1.3522 1.5769 2.5572 1.5517 1.8069 2.7217 1.5446 1.9407 1.9689 1.7513 1.4058 2.9334 1.3628 1.2750 1.2064 2.0129 1.3017 1.3319 1.3559 1.4277 1.5781 1.4007 1.3938 1.4195 1.5312 1.1439 1.0554 1.0886 1.0832 1.0835 1.0821 1.0907 1.0860 1.0847 1.0963 1.0549 10.3672 8.2007 9.5281 1.0649 1.0634 1.0586 1.0594 1.0286 1.0601 1.0622 1.0635 1.0661 1.0903 1.1023 1.0975 1.1021 1.1016 1.1022 1.1018 1.1025 1.0839 1.1050 1.0991 1.1046
irintensity: 1.8939 1.8693 0.9737 3.7237 0.8636 0.5098 0.0285 2.3838 1.0401 5.4796 0.8818 1.3637 3.0606 3.0844 2.1924 8.3257 7.0708 0.5682 0.6250 3.2491 1.2269 0.3276 2.1017 4.8575 10.5579 2.1158 18.8713 3.7938 19.0230 2.9276 3.0522 10.0800 9.9225 16.0024 0.4921 6.5587 0.5411 2.8854 11.4437 8.2027 5.5306 27.5506 26.7420 14.6328 10.4638 44.5821 4.5156 28.3739 31.9592 1.6974 0.2959 1.4600 2.7156 0.6116 3.7489 1.4110 18.8132 0.7002 39.7210 2.8692 21.5279 53.6459 5.0702 3.8832 27.8876 54.0591 2.1379 0.7960 2.8372 75.2543 0.6713 0.6821 1.2496 0.4091 2.9938 1.3992 0.1237 1.1381 3.2893 10.7617 18.4417 11.9897 1.8259 6.0098 20.7583 1.8789 17.1861 31.1989 12.8176 11.5025 325.7584 25.9485 48.6470 34.1393 40.7568 12.2682 22.2340 43.0631 11.3174 63.0474 33.4226 28.3676 45.0957 37.9798 65.5054 5.3996 22.6232 3.5351 58.1646 27.3676 6.9050 21.1649 32.4762 14.9587
temp: 298.150 k
press: 1.00000 atm
elementType: 8 8 8 7 6 6 6 6 6 6 6 6 6 6 6 6 6 6 6 1 1 1 1 1 1 1 1 1 1 1 1 1 1 1 1 1 1 1 1 1
symmnumber: 1
zpe: 880486.3 jmol-1
zpe.correction: 0.335360 hartree
zpe.thermalcorrener: 0.353585 hartree
zpe.thermalcorrenthalpy: 0.354530 hartree
zpe.thermalcorrgfe: 0.289447 hartree
zpe.sumelectzpe: -863.105966 hartree
zpe.sumelectthermal: -863.087741 hartree
zpe.sumelectthermalent: -863.086796 hartree
zpe.sumelectthermalfe: -863.151879 hartree
dipole: 2.2726 0.1436 0.9980
dipole: 2.4862
quadrupole: -102.0438 -122.0969 -109.5334
quadrupole: 5.4481 0.3646 8.4572
quadrupole: 9.1809 -10.8722 1.6913 5.4481 0.3646 8.4572
hfenergy: -863.441326 hartree
pointgroup: C01 [X(C15H21N1O3)]
dipole: 0.8998335 0.0436357 0.3810153 debye
polarizability: 224.0017986|-4.9787204|154.0906173|0.5841624|0.6849017|138.3633828 unknown
InChI: InChI=1S/C15H21NO3/c1-19-16-13(18)14(8-4-2-5-9-14)12(17)15(16)10-6-3-7-11-15/h6,10H,2-5,7-9,11H2,1H3
charge 0 multiplicity 1
40 atoms
O  1.435181 2.053581 -0.46229
O  -0.05411 -2.472227 0.523633
O  -1.446216 2.089486 -0.331288
N  0.601255 0.94564 -0.092164
C  -1.33401 -0.393221 0.111926
C  1.225654 -0.401444 0.052296
C  -2.152567 -0.917858 -1.119709
C  -2.211066 -0.477636 1.404938
C  -0.068342 -1.247331 0.271104
C  -0.787799 1.027421 -0.140577
C  1.948715 -0.891765 -1.241723
C  -3.522894 -0.219241 -1.26431
C  -3.582514 0.216546 1.242335
C  -4.360115 -0.345412 0.029513
C  2.140902 -0.464047 1.266806
C  3.406549 -0.389178 -1.324266
C  4.225156 -0.891733 -0.114756
C  3.476098 -0.698656 1.18835
C  1.422014 3.095497 0.603768
H  -2.294809 -2.006582 -0.967446
H  -1.558056 -0.789987 -2.04531
H  -1.658247 -0.037714 2.258033
H  -2.353955 -1.554044 1.626973
H  1.369782 -0.562897 -2.124312
H  1.937704 -1.999205 -1.221709
H  -4.063831 -0.671045 -2.118516
H  -3.366974 0.850407 -1.496318
H  -3.430913 1.303484 1.106458
H  -4.166216 0.074544 2.172735
H  -5.319399 0.193697 -0.086987
H  -4.607589 -1.412822 0.209548
H  1.659043 -0.321855 2.243441
H  3.408227 0.715192 -1.34308
H  3.86582 -0.741656 -2.266831
H  5.200492 -0.369364 -0.064836
H  4.465079 -1.97022 -0.234084
H  4.057356 -0.760193 2.119225
H  2.117481 3.863473 0.230033
H  1.784929 2.67379 1.558266
H  0.404985 3.508372 0.707329
