program: Gaussian 09
title: 000283050
version: EM64L-G09RevD.01
frameworkgroup: C1[X(C11H15NO)]
method: RPBEPBE
basis: SDD
operation: Freq
keyword: #p
keyword: freq=noraman
keyword: PBEPBE/SDD
title: #p freq=noraman PBEPBE/SDD
converged: YES YES NO NO
title: Mulliken charges:
elementType: O N C C C C C C C C C C C H H H H H H H H H H H H H H H
charge: -0.272984 -0.378831 0.307494 0.292305 -0.476954 0.464071 -0.584965 -0.386308 -0.405589 -0.833999 -0.811114 0.255316 -0.777143 0.274094 0.230599 0.232855 0.246329 0.229907 0.232104 0.225800 0.236209 0.300780 0.224418 0.224951 0.233472 0.253845 0.209064 0.254273
chargesum: 0.00000
title: Mulliken charges with hydrogens summed into heavy atoms:
elementType: O N C C C C C C C C C C C
charge: -0.272984 -0.078052 0.307494 0.292305 0.027740 0.464071 -0.352110 -0.139978 -0.175682 -0.139886 -0.128272 0.255316 -0.059962
polarizability: 1.73305521e+02 -7.57428073e-01 1.32341907e+02 -4.73970715e+00 2.24521028e-02 8.29128506e+01
1716.lowfreq: -21.7770 -10.2078 -0.0005 -0.0003 0.0005 3.2082 8.2197 22.5908 28.5547
frequency: -21.0490 22.4567 27.9733 58.8775 76.7102 124.9126 157.6622 202.1388 205.1043 242.3492 268.9267 289.1616 318.2546 420.0829 441.5305 468.1562 497.1274 543.8409 547.5102 575.7646 606.7435 612.1717 711.6609 721.9631 770.6590 827.4999 875.1357 890.4352 927.8279 963.8499 976.4329 983.0023 1013.8760 1019.3622 1040.5004 1043.0009 1048.3662 1087.6875 1128.3110 1168.3376 1216.6135 1228.5083 1248.3600 1266.9297 1289.3421 1339.7765 1381.5000 1386.4235 1397.4242 1401.6714 1405.9297 1450.3266 1463.4387 1466.0035 1469.9609 1473.4570 1476.3763 1483.2668 1488.2445 1502.6798 1586.1993 1619.8389 1626.7963 2969.2066 2973.7985 2977.1439 2994.2743 3023.9690 3044.3546 3054.6088 3082.6155 3083.7067 3095.5740 3099.3046 3110.2997 3117.0160 3142.3617 3553.5596
redmass: 1.0417 3.3300 3.1535 1.6847 1.9468 2.9579 1.1531 2.6373 3.7989 4.1719 2.6099 2.6717 3.2832 2.8189 2.7509 3.7441 3.0838 3.3742 2.5201 2.6736 2.7768 1.9780 5.0881 3.0756 3.9507 1.3059 3.0390 1.2997 3.3074 1.3579 1.6560 1.5138 1.9356 1.5765 1.6365 1.6033 1.5903 3.6968 2.3221 1.5129 1.6882 1.2227 2.5003 2.4430 1.5102 1.8698 2.2952 1.3135 1.2265 1.3448 2.5972 1.0457 1.1258 1.0986 1.1260 1.0692 1.2019 1.1376 1.6421 2.3293 6.3133 6.3848 6.3470 1.0385 1.0387 1.0588 1.0362 1.1006 1.0966 1.0949 1.0980 1.0997 1.1000 1.0985 1.0911 1.0872 1.0959 1.0777
irintensity: 0.1004 2.4841 4.0181 7.6084 0.9771 6.3751 1.6081 3.8010 0.5324 2.2814 5.6141 0.9087 0.3158 5.5220 7.1603 13.5058 13.8493 2.5910 46.6227 36.4423 7.0561 35.7874 1.8732 1.5793 2.4176 29.1758 8.1192 2.1165 2.1812 0.5838 3.8758 0.5997 10.5727 10.7047 13.8522 1.4063 19.1282 13.3032 2.2089 2.2845 2.7647 2.4225 71.6860 62.6992 4.2504 6.9069 16.5765 51.5138 9.6154 8.0974 0.2556 14.7148 103.7399 12.2751 2.2273 17.5771 54.3749 50.0944 109.5335 39.7308 2.4233 176.2858 34.0789 33.2301 38.2878 33.0269 12.9484 17.9326 19.4334 24.2107 20.9545 19.5766 20.0941 10.8827 28.8133 13.3535 18.1046 14.8639
temp: 298.150 k
press: 1.00000 atm
elementType: 8 7 6 6 6 6 6 6 6 6 6 6 6 1 1 1 1 1 1 1 1 1 1 1 1 1 1 1
symmnumber: 1
zpe: 615456.1 jmol-1
zpe.correction: 0.234415 hartree
zpe.thermalcorrener: 0.247803 hartree
zpe.thermalcorrenthalpy: 0.248748 hartree
zpe.thermalcorrgfe: 0.192504 hartree
zpe.sumelectzpe: -557.194797 hartree
zpe.sumelectthermal: -557.181409 hartree
zpe.sumelectthermalent: -557.180465 hartree
zpe.sumelectthermalfe: -557.236709 hartree
dipole: 1.9445 -0.6403 -3.5045
dipole: 4.0587
quadrupole: -78.5335 -71.0047 -82.9850
quadrupole: 4.8665 11.8714 -0.4275
quadrupole: -1.0257 6.5030 -5.4773 4.8665 11.8714 -0.4275
hfenergy: -557.4292123 hartree
pointgroup: C01 [X(C11H15N1O1)]
dipole: 0.6996099 0.2432079 -1.4146305 debye
polarizability: 172.6124233|3.1326854|127.0994816|-8.7213388|15.0779891|88.8483741 unknown
InChI: InChI=1S/C11H15NO/c1-8-4-5-11(9(2)6-8)7-12-10(3)13/h4-6,12H,7H2,1-3H3
charge 0 multiplicity 1
28 atoms
O  -3.605121 -0.192322 1.362447
N  -2.27143 0.321838 -0.475804
C  0.172824 0.504696 0.049892
C  1.302259 1.361484 0.21282
C  -1.241209 1.023494 0.304109
C  2.817622 -0.518447 -0.375687
C  2.598461 0.831151 -0.003163
C  0.385505 -0.848314 -0.309394
C  1.684563 -1.356737 -0.51871
C  1.145668 2.817116 0.62719
C  4.220323 -1.043376 -0.631035
C  -3.397618 -0.238547 0.111212
C  -4.371246 -0.915561 -0.850586
H  -1.532476 0.887337 1.36473
H  -1.292855 2.109949 0.096831
H  3.464865 1.493085 0.126608
H  -0.48112 -1.511638 -0.411796
H  1.820282 -2.411098 -0.789441
H  2.130995 3.299751 0.741391
H  0.574435 3.400885 -0.121074
H  0.610222 2.916948 1.590116
H  -2.149776 0.259314 -1.487777
H  4.977593 -0.468213 -0.069756
H  4.31366 -2.105026 -0.340534
H  4.48349 -0.973623 -1.704705
H  -5.350805 -0.410883 -0.785995
H  -4.034391 -0.907265 -1.901972
H  -4.522422 -1.960794 -0.530814
