program: Gaussian 09
title: 000283041
version: EM64L-G09RevD.01
frameworkgroup: C1[X(C5H5Cl2N3OS)]
method: RPBEPBE
basis: SDD
operation: Freq
keyword: #p
keyword: freq=noraman
keyword: PBEPBE/SDD
title: #p freq=noraman PBEPBE/SDD
converged: NO NO NO NO
title: Mulliken charges:
elementType: Cl Cl S O N N N C C C C C H H H H H
charge: 0.068579 0.068215 0.192389 -0.115683 -0.368346 -0.001114 -0.046513 -0.094317 -0.029216 0.365743 -0.734740 -0.713851 0.330246 0.315303 0.246605 0.246580 0.270120
chargesum: 0.00000
title: Mulliken charges with hydrogens summed into heavy atoms:
elementType: Cl Cl S O N N N C C C C C
charge: 0.068579 0.068215 0.192389 -0.115683 -0.038100 -0.001114 -0.046513 -0.094317 -0.029216 0.365743 -0.419436 0.049453
polarizability: 1.85104633e+02 -4.83160055e+00 9.01033987e+01 -4.43664704e+00 1.05293838e+01 8.87514832e+01
1716.lowfreq: -18.8616 -4.1302 0.0015 0.0023 0.0025 3.4022 9.2699 16.1578 51.7577
frequency: -18.0222 10.6564 51.7187 89.4010 125.4186 149.8215 171.4051 213.8602 230.6495 255.9398 301.5271 338.7514 354.6837 501.0996 529.2747 542.9820 565.9482 583.9847 590.7610 622.0385 705.6978 729.1408 750.6978 816.9709 886.8579 948.9207 1037.0660 1037.5432 1060.8636 1109.3763 1177.3910 1181.8047 1260.9433 1395.4965 1441.8413 1454.5945 1477.1354 1486.2702 1503.7225 1666.1046 2994.4939 3077.3290 3097.8800 3117.7887 3547.3041
redmass: 16.4808 12.3561 5.6615 7.7699 1.1747 3.7330 18.8385 6.7031 6.7016 9.2757 12.3659 5.8061 4.8853 5.8136 10.1873 8.1905 2.2283 10.8825 2.3476 8.2370 7.2384 8.7041 10.1148 7.6436 6.4881 3.0868 1.4072 6.6761 2.7921 2.4958 3.8806 1.0636 1.5020 1.2145 1.6059 1.0438 2.3177 2.2685 3.3711 7.6972 1.0367 1.0984 1.0893 1.0989 1.0773
irintensity: 0.3069 0.2089 0.2023 0.0945 1.7101 9.0930 0.5649 0.6452 6.0940 0.9810 1.3475 0.2513 0.0279 33.3886 29.7472 0.1932 41.9233 45.2266 7.3825 150.6484 4.3991 0.7900 34.5841 9.3321 15.0036 10.2065 3.3036 7.9977 52.8509 123.3655 54.3342 9.1189 7.3171 11.9464 45.1814 22.1275 644.7475 16.7021 28.7660 148.2711 10.6798 9.5234 12.3388 2.8003 33.5473
temp: 298.150 k
press: 1.00000 atm
elementType: 17 17 16 8 7 7 7 6 6 6 6 6 1 1 1 1 1
symmnumber: 1
zpe: 270315.1 jmol-1
zpe.correction: 0.102958 hartree
zpe.thermalcorrener: 0.114882 hartree
zpe.thermalcorrenthalpy: 0.115826 hartree
zpe.thermalcorrgfe: 0.061695 hartree
zpe.sumelectzpe: -1750.252431 hartree
zpe.sumelectthermal: -1750.240506 hartree
zpe.sumelectthermalent: -1750.239562 hartree
zpe.sumelectthermalfe: -1750.293693 hartree
dipole: -3.2508 4.7780 4.5764
dipole: 7.3716
quadrupole: -79.4291 -94.4330 -94.0735
quadrupole: -0.7178 -0.6172 -2.9133
quadrupole: 9.8827 -5.1211 -4.7616 -0.7178 -0.6172 -2.9133
hfenergy: -1750.3553882 hartree
pointgroup: C01 [X(C5H5Cl2N3O1S1)]
dipole: -1.1811557 2.6487813 -0.0001752 debye
dipolederiv: -0.3574308 0.0058266 -0.2473337 0.021002 -0.0864631 0.07997 -0.1998736 0.0301975 -0.5473388 -0.3548686 0.0028033 0.2432922 0.0173403 -0.0863338 -0.0757341 0.1982289 -0.0261173 -0.5539172 -0.5461288 -0.066581 -0.0003631 0.0571482 -0.5988262 0.0014915 -0.0008219 0.0014252 0.0909236 -0.5491555 0.0024596 0.00058 0.5266905 -0.7525876 0.0017156 -0.0000246 0.0002225 -0.251762 -2.0694787 0.3015394 -0.000221 0.3502801 -0.4579211 -0.0003935 -0.0014671 0.0003302 -0.3061691 -0.2973367 0.1739926 -0.0006514 -0.2662624 -0.4229382 0.0004803 0.0005196 0.0009311 -0.1161587 -0.2821096 -0.1629616 0.000614 0.2050832 -0.4522424 0.0006057 -0.0008512 0.000635 -0.1517203 1.5005832 -0.2218027 0.001095 0.0432637 0.6431131 -0.0013791 0.0015573 -0.0016496 0.0824715 0.6725067 0.2114827 0.0003256 0.1367749 0.7448167 -0.0013803 0.0003579 -0.0016087 -0.0661721 1.6643721 -0.2705275 -0.002279 -0.9565818 1.1038162 -0.0018342 -0.0024842 -0.0014408 0.1016577 0.6001485 -0.0979861 0.0052151 -0.1862956 0.1811502 -0.0037559 0.0051791 -0.0032432 1.2609083 -0.2330091 0.015223 -0.0003513 0.025674 -0.0143784 0.0001872 -0.0000591 0.0001672 0.0774332 0.2079621 0.0350628 -0.0002926 0.0131853 0.1538097 0.000326 -0.0004884 0.0004113 0.307387 -0.0605681 0.0812496 0.000239 0.032095 -0.0709347 -0.0002833 0.0002529 -0.0002392 -0.042633 0.0306475 0.0081793 0.0135383 0.0386357 0.0669808 -0.0991165 0.0673392 -0.0844906 -0.0120997 0.0309969 0.0078676 -0.0133329 0.0381293 0.0674873 0.0989982 -0.0673622 0.0842604 -0.0127715 0.0428687 -0.0258276 -0.0000743 -0.0961626 -0.0185483 0.0001023 -0.0000024 0.0002091 0.1399609 unknown
polarizability: 184.4987417|-9.7069741|100.5820403|0.1093404|-0.2280553|78.8787329 unknown
InChI: InChI=1S/C5H5Cl2N3OS/c1-2-9-10-5(12-2)8-4(11)3(6)7/h3,8H,1H3
charge 0 multiplicity 1
17 atoms
Cl 3.986349 0.171586 1.527104
Cl 3.967711 0.187207 -1.542318
S  -2.072101 1.593365 -0.002427
O  1.638889 -1.471174 0.005274
N  0.571476 0.642086 0.002403
N  -1.24552 -0.973668 0.004455
N  -2.645138 -1.022121 0.003016
C  -0.777011 0.270181 0.001973
C  -3.249548 0.160498 -0.000429
C  1.688355 -0.227516 0.003978
C  3.007595 0.5816 0.000552
C  -4.731904 0.362987 -0.002516
H  0.758067 1.646717 0.000607
H  2.880171 1.673001 0.006798
H  -5.06594 0.923421 0.889016
H  -5.063789 0.920966 -0.896376
H  -5.218565 -0.625338 -0.00171
