program: Gaussian 09
title: 000028187
version: EM64L-G09RevD.01
frameworkgroup: C1[X(C11H15NOS)]
method: RPBEPBE
basis: SDD
operation: Freq
keyword: #p
keyword: freq=noraman
keyword: PBEPBE/SDD
title: #p freq=noraman PBEPBE/SDD
converged: YES YES NO NO
title: Mulliken charges:
elementType: S O N C C C C C C C C C C C H H H H H H H H H H H H H H H
charge: 0.026011 -0.187583 -0.094084 -0.368896 -0.276047 -0.612956 -0.613723 0.379993 -0.322031 -0.347259 -0.294477 -0.217181 -0.244329 -0.226744 0.232300 0.206010 0.229961 0.228593 0.220463 0.195349 0.227550 0.223252 0.194043 0.230247 0.263888 0.244792 0.233561 0.234541 0.234758
chargesum: 0.00000
title: Mulliken charges with hydrogens summed into heavy atoms:
elementType: S O N C C C C C C C C C C C
charge: 0.026011 -0.187583 -0.094084 0.069414 0.182506 0.030405 0.033820 0.379993 -0.322031 -0.083371 -0.049686 0.016380 -0.009789 0.008015
polarizability: 1.62150789e+02 1.23828320e+01 1.73410796e+02 -1.94057648e+01 1.33148663e+01 1.12247189e+02
1716.lowfreq: -5.9440 -1.8696 -0.0027 0.0008 0.0016 7.8722 24.0829 26.1349 38.0623
frequency: 23.9358 26.0755 38.0486 64.2666 85.6894 104.7716 175.1207 179.4936 202.3711 213.4982 242.3490 258.5598 309.7244 347.8314 387.1841 403.1378 425.1010 452.6694 496.0921 525.8446 604.2899 619.5191 691.4724 698.9660 775.1393 804.6279 819.0113 854.0783 873.2283 933.6179 980.3078 984.1432 987.6424 1000.0726 1028.8929 1034.3874 1036.7293 1063.0964 1075.0175 1079.5583 1091.5123 1134.0895 1144.3409 1171.7613 1174.3221 1190.4016 1243.8334 1268.1483 1269.7086 1293.0292 1314.3466 1321.5531 1376.6394 1378.7535 1421.3101 1432.1120 1443.1350 1459.3104 1463.9165 1469.7211 1474.9093 1475.7744 1479.6958 1487.4602 1579.2254 1602.7362 2859.6390 2868.9992 2897.9188 3021.7363 3022.2284 3027.7228 3054.9407 3079.8567 3084.0203 3104.8813 3130.0508 3138.2877 3149.6308 3158.4219 3170.4295
redmass: 3.2388 3.1274 6.5940 3.7244 2.2064 4.1503 3.0429 3.6366 1.7042 1.5042 1.7241 3.0577 4.8880 2.7731 3.1274 2.8672 2.6124 3.4201 5.6333 5.6678 5.9085 6.0111 6.1191 1.7800 1.8678 1.3186 3.2611 1.2482 7.4848 1.4122 1.4173 5.5024 5.8873 1.3337 2.2106 1.9139 1.6285 1.7106 2.0448 2.1050 1.4108 1.6342 2.4371 1.8033 1.0605 1.1148 1.8346 4.2231 2.5568 1.2025 1.3676 1.3475 1.4122 6.2960 1.1402 2.2696 1.1542 1.0715 1.0708 1.0612 2.1678 1.0561 1.0887 1.0541 5.8249 6.0066 1.0562 1.0571 1.0692 1.0624 1.0696 1.0711 1.0904 1.1011 1.1007 1.1093 1.0850 1.0879 1.0925 1.0965 1.1016
irintensity: 0.1881 0.9128 1.1770 0.6597 1.1419 2.5004 1.7783 0.2705 0.3465 1.8007 1.1033 2.6969 3.2119 15.8880 1.2764 0.4043 0.2974 13.0564 5.4867 9.7802 1.4125 2.8419 8.0561 45.3411 67.1537 6.9796 10.4379 2.1114 26.1173 6.0027 5.4356 35.5311 0.8979 0.5048 22.0274 37.6470 12.0864 6.7902 91.8600 26.9246 14.9224 116.8511 211.2871 79.6141 3.0308 4.1258 7.9962 120.6079 32.2103 3.8950 3.8351 2.7563 7.0708 3.7613 2.3910 18.5710 5.2555 1.2295 14.2055 4.3466 0.1352 19.0511 20.3491 10.8811 1.1144 6.3870 65.9453 156.8368 89.1482 24.2665 21.6574 60.5084 7.2416 18.7839 54.6888 29.3513 0.5557 3.0798 14.8899 21.3360 18.5479
temp: 298.150 k
press: 1.00000 atm
elementType: 16 8 7 6 6 6 6 6 6 6 6 6 6 6 1 1 1 1 1 1 1 1 1 1 1 1 1 1 1
symmnumber: 1
zpe: 621077.6 jmol-1
zpe.correction: 0.236556 hartree
zpe.thermalcorrener: 0.251517 hartree
zpe.thermalcorrenthalpy: 0.252461 hartree
zpe.thermalcorrgfe: 0.191750 hartree
zpe.sumelectzpe: -955.102476 hartree
zpe.sumelectthermal: -955.087515 hartree
zpe.sumelectthermalent: -955.086571 hartree
zpe.sumelectthermalfe: -955.147282 hartree
dipole: 1.6020 -4.7075 0.6440
dipole: 5.0142
quadrupole: -81.2273 -99.6388 -87.4367
quadrupole: 9.1762 -0.9508 1.1307
quadrupole: 8.2069 -10.2045 1.9976 9.1762 -0.9508 1.1307
hfenergy: -955.3390319 hartree
pointgroup: C01 [X(C11H15N1O1S1)]
dipole: -0.5346408 -1.891713 0.1649249 debye
polarizability: 160.8908968|-18.030464|164.3033952|-18.6790619|-23.6031179|122.6144825 unknown
InChI: InChI=1S/C11H15NOS/c1-12(2)8-9-13-11(14)10-6-4-3-5-7-10/h3-7H,8-9H2,1-2H3
charge 0 multiplicity 1
29 atoms
S  1.206456 2.991632 -1.035255
O  -0.530436 1.530601 0.321461
N  -3.598197 -0.632173 0.280243
C  -2.732705 0.542086 0.029398
C  -1.307836 0.267227 0.539405
C  -3.438451 -1.703041 -0.725434
C  -5.016777 -0.278303 0.491666
C  1.589112 0.348303 -0.18951
C  0.716587 1.554445 -0.286612
C  2.412503 -0.020742 -1.288509
C  1.673226 -0.403515 1.017717
C  3.283005 -1.124933 -1.19055
C  2.564116 -1.492691 1.119974
C  3.364409 -1.86365 0.014511
H  -3.132739 1.408865 0.584318
H  -2.692377 0.833782 -1.04783
H  -0.822957 -0.571717 0.011575
H  -1.329686 0.059553 1.622281
H  -2.379631 -2.004497 -0.806278
H  -3.789752 -1.401118 -1.744542
H  -4.015187 -2.591926 -0.413573
H  -5.581092 -1.181444 0.786624
H  -5.509483 0.152004 -0.41617
H  -5.101486 0.457467 1.310417
H  2.362915 0.576588 -2.204872
H  1.075639 -0.108011 1.886868
H  3.904458 -1.40452 -2.048105
H  2.636966 -2.047325 2.061767
H  4.050499 -2.714149 0.093116
