program: Gaussian 09
title: 000283033
version: EM64L-G09RevD.01
frameworkgroup: C1[X(C7H6ClFO2S)]
method: RPBEPBE
basis: SDD
operation: Freq
keyword: #p
keyword: freq=noraman
keyword: PBEPBE/SDD
title: #p freq=noraman PBEPBE/SDD
converged: YES YES NO NO
title: Mulliken charges:
elementType: Cl S F O O C C C C C C C H H H H H H
charge: -0.012554 1.070905 -0.342262 -0.474269 -0.467490 -0.243400 0.517801 -0.223379 -0.363656 -0.789537 -0.102502 -0.189995 0.319939 0.255038 0.274300 0.228093 0.275024 0.267944
chargesum: 0.00000
title: Mulliken charges with hydrogens summed into heavy atoms:
elementType: Cl S F O O C C C C C C C
charge: -0.012554 1.070905 -0.342262 -0.474269 -0.467490 -0.243400 0.517801 0.096561 -0.108618 -0.012120 -0.102502 0.077950
polarizability: 1.57584988e+02 7.57851323e+00 1.27071241e+02 -4.81193654e+00 -2.45314869e-01 6.24614100e+01
1716.lowfreq: -10.1585 0.0009 0.0016 0.0033 7.1916 9.0183 47.4303 96.3811 100.2186
frequency: 47.3371 96.3386 100.2140 126.7984 133.8659 181.4488 210.7438 232.8298 276.0953 279.8825 302.1570 321.6354 360.7124 412.8976 443.8460 454.2263 527.4214 554.0624 624.9881 666.0312 678.4455 800.0563 829.8802 856.4149 889.4087 965.0784 980.5956 998.5172 1003.8630 1051.6770 1089.1030 1149.1302 1213.1816 1268.5281 1343.7047 1389.1430 1409.7739 1457.6757 1461.5050 1479.3063 1556.1461 1597.4609 2996.7530 3080.0259 3109.8391 3150.1927 3167.0843 3177.9281
redmass: 11.2343 1.5315 4.8115 3.5144 3.9441 11.4927 9.2691 6.3514 8.4733 6.1840 6.9152 6.2030 9.4024 6.5233 3.3209 5.4001 6.3827 8.7797 6.8477 7.7510 3.4844 5.6781 1.2863 17.2647 1.3500 1.3521 4.4393 7.7542 1.6606 1.5220 2.5601 1.2970 2.7603 1.3435 3.5748 5.0162 1.2088 2.0251 1.1987 1.1000 6.1294 7.4921 1.0372 1.0972 1.1003 1.0898 1.0931 1.0964
irintensity: 1.0500 0.9729 0.5524 2.0023 1.9430 3.8118 0.5437 2.3007 6.6993 2.9156 2.4610 3.8152 6.1679 29.1117 9.5100 54.5091 89.3326 53.5495 11.1040 3.1604 5.0858 11.3374 34.7593 75.7527 17.3373 0.0945 63.4600 13.8653 15.7829 13.6476 33.0532 9.7239 10.0147 8.8597 10.0593 1.4812 29.5155 84.1042 31.3132 22.2873 3.9675 10.6607 6.7372 1.8033 12.9622 4.2700 13.7595 2.7580
temp: 298.150 k
press: 1.00000 atm
elementType: 17 16 9 8 8 6 6 6 6 6 6 6 1 1 1 1 1 1
symmnumber: 1
zpe: 302080.7 jmol-1
zpe.correction: 0.115056 hartree
zpe.thermalcorrener: 0.127456 hartree
zpe.thermalcorrenthalpy: 0.128400 hartree
zpe.thermalcorrgfe: 0.075715 hartree
zpe.sumelectzpe: -1377.700865 hartree
zpe.sumelectthermal: -1377.688466 hartree
zpe.sumelectthermalent: -1377.687521 hartree
zpe.sumelectthermalfe: -1377.740206 hartree
dipole: -3.7734 4.4564 -0.4667
dipole: 5.8580
quadrupole: -93.7940 -78.0767 -89.3179
quadrupole: 1.4495 -0.1327 0.4705
quadrupole: -6.7311 8.9862 -2.2551 1.4495 -0.1327 0.4705
hfenergy: -1377.8159214 hartree
pointgroup: C01 [X(C7H6Cl1F1O2S1)]
dipole: -1.713244 -1.5385415 0.096514 debye
dipolederiv: -0.5723633 0.312707 -0.0052249 0.384178 -0.363566 -0.0012679 -0.0042528 -0.0066835 -0.0370517 1.7533164 0.193831 -0.0288059 0.2526012 1.3456488 0.0707741 -0.040578 0.0561936 1.497497 -0.567559 -0.0252614 0.1399112 0.0196952 -0.3935784 -0.1492593 0.2862241 -0.0922462 -0.7728027 -0.5707712 -0.0425343 -0.0211647 -0.1146223 -0.6118888 -0.0107857 -0.0472193 0.0043359 -0.394706 -0.6477921 -0.0400924 -0.0749904 -0.0397329 -0.4911205 0.0682597 -0.1084362 0.0493732 -0.4770095 0.0116493 0.0457655 0.0110002 0.0834354 -0.0231336 0.0387513 -0.1017184 -0.0048408 -0.171032 0.0150076 -0.4270696 -0.0176046 -0.0038438 0.100753 0.0038718 0.0093367 -0.0157291 0.0290045 -0.300787 0.2739627 -0.0048128 -0.1773662 -0.2497223 -0.0185402 0.0263186 0.0027053 -0.0425485 -0.0940106 0.2080195 0.0104711 -0.0231604 0.049811 0.007847 -0.0050748 0.0147902 -0.1343257 -0.1729343 0.1775269 0.0187967 0.0900997 0.0118476 0.0179757 -0.0070317 0.0438446 -0.0129744 0.8211633 -0.6661818 0.0025712 -0.6090388 0.4596618 0.0028718 0.005528 0.0012682 -0.0690909 -0.0525951 0.13243 0.0083268 0.1791234 -0.0655948 0.0053227 0.0062033 0.0068885 -0.0616108 0.1578462 -0.0270855 -0.0027502 0.0175903 0.0978199 -0.0054565 -0.0085134 -0.0029183 0.1688365 0.0456096 -0.0077229 -0.0033414 -0.0275217 -0.0636719 -0.0126341 -0.0062314 -0.0156213 0.15555 0.078155 0.0457836 -0.0617907 0.0224226 0.0955606 -0.0483748 -0.0668699 -0.0085554 0.0031237 0.0525765 -0.1388245 -0.0207163 -0.0298255 -0.0885632 -0.0298701 -0.0039967 -0.0431043 0.1230361 0.0572585 0.0188358 0.0577409 0.0028166 0.0893521 0.0650274 0.07065 0.0136988 0.0352992 -0.01377 -0.0340896 -0.0076163 -0.0268506 0.1003844 -0.0045128 -0.0043378 -0.0033994 0.1608051 unknown
polarizability: 154.8035549|-11.6601865|129.6758711|5.5531982|1.6941274|62.6382124 unknown
InChI: InChI=1S/C7H6ClFO2S/c1-5-2-3-6(8)4-7(5)12(9,10)11/h2-4H,1H3
charge 0 multiplicity 1
18 atoms
Cl -3.538866 1.720661 0.014623
S  1.908465 0.739098 0.208571
F  2.519717 0.174002 -1.462669
O  1.855058 2.344069 0.172362
O  2.826423 -0.03797 1.272986
C  0.16548 0.030319 0.070378
C  -0.024251 -1.368746 -0.008479
C  -0.850115 1.002025 0.077088
C  -1.3845 -1.774918 -0.076903
C  1.101783 -2.380288 -0.038934
C  -2.173133 0.52926 0.008291
C  -2.451411 -0.850086 -0.06711
H  -0.616489 2.069905 0.126595
H  -1.606098 -2.845099 -0.144705
H  1.669102 -2.379549 0.908878
H  0.70509 -3.393583 -0.208403
H  1.8228 -2.144325 -0.841739
H  -3.486557 -1.198575 -0.121729
