program: Gaussian 09
title: 000283030
version: EM64L-G09RevD.01
frameworkgroup: C1[X(C4H4Cl2N4O)]
method: RPBEPBE
basis: SDD
operation: Freq
keyword: #p
keyword: freq=noraman
keyword: PBEPBE/SDD
title: #p freq=noraman PBEPBE/SDD
converged: YES YES NO NO
title: Mulliken charges:
elementType: Cl Cl O N N N N C C C C H H H H
charge: -0.014005 0.014062 -0.415785 -0.127823 0.031811 -0.641833 -0.606519 0.523487 -0.170793 0.175957 -0.180225 0.364233 0.340321 0.362543 0.344568
chargesum: 0.00000
title: Mulliken charges with hydrogens summed into heavy atoms:
elementType: Cl Cl O N N N N C C C C
charge: -0.014005 0.014062 -0.415785 -0.127823 0.031811 0.062721 0.100592 0.523487 -0.170793 0.175957 -0.180225
polarizability: 1.48426551e+02 -2.20619245e+00 1.21058468e+02 -9.50869290e-04 4.67475380e-03 3.58468139e+01
1716.lowfreq: -7.3650 0.0021 0.0024 0.0027 5.9443 7.1064 78.3572 133.8930 171.2209
frequency: 78.3497 133.8903 171.2203 180.0189 237.5639 288.2776 306.7361 347.4397 350.8868 367.2444 385.5437 491.0020 501.2935 552.9920 563.8188 586.7018 600.1093 604.1111 626.9632 664.3527 701.1864 784.2801 879.2786 997.9040 1072.0255 1153.0881 1184.8659 1307.6174 1336.7317 1445.4084 1467.8222 1509.5244 1535.7933 1609.6184 1647.5145 3449.6033 3494.3627 3673.8679 3695.5196
redmass: 9.9078 11.0392 5.6927 29.8989 6.6915 9.7728 2.9693 5.6835 12.3991 6.4496 12.3594 1.1308 1.2193 7.7533 6.3869 7.1165 1.9303 5.5249 1.5589 1.4170 11.7307 4.6192 9.6051 2.5140 2.3248 3.6286 5.8680 6.1819 5.2804 5.1383 4.2576 1.4591 1.5063 4.4521 5.3115 1.0506 1.0485 1.0978 1.1007
irintensity: 0.4071 0.8878 12.4555 0.3998 0.6161 0.5998 9.2252 16.8447 8.8867 12.6683 5.3925 26.4367 321.6502 19.9922 2.4005 11.6378 14.6180 1.2621 180.5989 81.1370 16.0624 31.3247 53.8420 16.6853 49.2437 4.9712 84.0862 201.2861 11.7970 11.6172 3.4338 7.5483 11.4584 825.3678 359.3770 87.9558 116.0749 91.2562 97.2676
temp: 298.150 k
press: 1.00000 atm
elementType: 17 17 8 7 7 7 7 6 6 6 6 1 1 1 1
symmnumber: 1
zpe: 245141.9 jmol-1
zpe.correction: 0.093370 hartree
zpe.thermalcorrener: 0.103578 hartree
zpe.thermalcorrenthalpy: 0.104522 hartree
zpe.thermalcorrgfe: 0.057403 hartree
zpe.sumelectzpe: -1368.337892 hartree
zpe.sumelectthermal: -1368.327684 hartree
zpe.sumelectthermalent: -1368.326740 hartree
zpe.sumelectthermalfe: -1368.373859 hartree
dipole: 1.6901 1.2704 0.0129
dipole: 2.1144
quadrupole: -79.0653 -65.2761 -79.0330
quadrupole: -9.3532 0.0557 -0.0462
quadrupole: -4.6072 9.1821 -4.5749 -9.3532 0.0557 -0.0462
hfenergy: -1368.4312618 hartree
pointgroup: C01 [X(C4H4Cl2N4O1)]
dipole: -0.5871913 0.5882966 0.0335167 debye
dipolederiv: -0.6012567 -0.2810512 0.0350492 -0.3470757 -0.2657084 0.0199035 0.0343688 0.0156998 -0.0071516 -0.6327435 0.3553416 0.0372477 0.4083738 -0.3312749 -0.0261919 0.0373531 -0.0228269 -0.0515691 -0.9159215 0.2855671 0.0347165 0.3626212 -0.5460757 -0.0231631 0.0343219 -0.0179907 -0.370305 0.3507092 -0.6367192 -0.0204984 -0.780007 -0.4551283 0.0454121 -0.020599 0.035815 0.0625428 -1.2274479 -0.248072 0.0626095 -0.1830697 -0.5395811 0.0093439 0.0626403 0.0134142 -0.1908782 -0.2005704 0.067797 -0.026904 -0.0021555 -1.3814721 -0.002952 -0.0268843 -0.0065789 -0.6423891 -1.2733815 -0.6594917 0.0344862 -0.5211811 -0.503352 0.0333512 0.0386486 0.0445639 -0.69244 0.0979756 -0.1284997 0.0044928 -0.020971 1.4685182 0.006873 0.0048297 0.0137741 0.1892855 0.5338041 0.74396 -0.0360935 0.5363835 -0.3153764 -0.0334918 -0.0367045 -0.0457941 -0.1167708 1.631779 0.7737703 -0.0847583 0.6775177 0.7325474 -0.0390607 -0.0845129 -0.0447394 0.2037907 1.2089384 -0.3807965 -0.0726178 -0.2412045 0.9693712 0.0187609 -0.0720169 0.0267349 0.0565655 0.2188326 0.0078046 0.0100157 -0.06979 0.3439889 0.0040936 0.0096027 -0.0008982 0.3791451 0.1944922 0.0329946 0.012 -0.0010258 0.3407853 -0.0002346 0.0117384 -0.0028305 0.3882881 0.3542093 0.01578 0.0016514 0.0706958 0.2089091 -0.0048168 -0.0001776 -0.0026481 0.3880802 0.2605811 0.0516152 0.0086028 0.1108884 0.2738489 -0.0078272 0.0073917 -0.0056952 0.4038058 unknown
polarizability: 148.0802284|-1.6600802|120.9830237|-6.8653884|0.4937397|36.268581 unknown
InChI: InChI=1S/C4H4Cl2N4O/c5-1-2(6)9-4(8)10(11)3(1)7/h7-8H2
charge 0 multiplicity 1
15 atoms
Cl 2.854337 1.400063 -0.125451
Cl 2.630646 -1.932102 -0.127207
O  -2.296121 1.336828 0.188819
N  -1.136408 0.620151 0.11546
N  -0.031846 -1.51621 0.037558
N  -0.016827 2.642609 0.055644
N  -2.407878 -1.319557 0.183942
C  0.08828 1.286945 0.042913
C  1.276777 0.512251 -0.033916
C  -1.160438 -0.778828 0.110098
C  1.156274 -0.886913 -0.03268
H  -0.977312 3.000846 0.116887
H  0.805442 3.237461 0.008938
H  -3.186416 -0.656564 0.229422
H  -2.525908 -2.327978 0.182672
