program: Gaussian 09
title: 000283038
version: EM64L-G09RevD.01
frameworkgroup: C1[X(C10H12N6O4)]
method: RPBEPBE
basis: SDD
operation: Freq
keyword: #p
keyword: freq=noraman
keyword: PBEPBE/SDD
title: #p freq=noraman PBEPBE/SDD
converged: YES YES NO NO
title: Mulliken charges:
elementType: O O O O N N N N N N C C C C C C C C C C H H H H H H H H H H H H
charge: -0.314939 -0.377474 -0.303264 -0.286881 -0.303826 -0.246756 -0.393127 -0.319646 -0.328517 0.007959 0.510744 0.496781 -0.388625 -0.396348 -0.379873 -0.393438 -0.260973 -0.291133 0.343323 0.170432 0.202941 0.225033 0.213101 0.223260 0.259603 0.249503 0.334346 0.365226 0.320114 0.352515 0.325378 0.384560
chargesum: 0.00000
title: Mulliken charges with hydrogens summed into heavy atoms:
elementType: O O O O N N N N N N C C C C C C C C C C
charge: -0.314939 0.007086 -0.303264 -0.286881 0.030520 0.118470 -0.073014 0.032869 -0.003139 0.007959 0.510744 0.496781 -0.185684 -0.171315 -0.166772 -0.170177 -0.001370 -0.041630 0.343323 0.170432
polarizability: 7.69479281e+02 -5.44923294e+01 1.51575803e+02 4.68016454e+01 7.93295302e+00 9.77170495e+01
1716.lowfreq: -85.5549 -3.3824 -2.4329 -0.0008 0.0001 0.0004 5.5925 16.6177 23.5199
frequency: -85.5516 16.5190 23.5053 31.4252 40.0445 47.3949 50.9163 76.5908 110.4810 131.6445 151.0991 171.2987 180.2026 200.9598 205.6633 248.6972 275.3589 284.8365 314.5689 333.7547 370.3408 377.7225 395.7172 419.7053 438.8785 445.8741 469.1872 515.2449 529.3064 536.5609 590.7115 621.8168 628.1412 645.6342 685.7042 687.1243 702.2658 728.0374 737.4014 776.9919 794.6813 819.2266 830.0451 847.5830 859.8852 921.9077 949.2182 959.6010 964.6086 970.9855 1007.0661 1050.4441 1109.1897 1151.8030 1170.7417 1192.9285 1202.5197 1216.0529 1267.8217 1284.0424 1296.6717 1309.7152 1324.8396 1349.4249 1350.1575 1376.0784 1418.0829 1446.8558 1450.3281 1482.0706 1492.6991 1507.5048 1529.3998 1562.4940 1597.2533 1609.7948 1618.4455 1633.4506 3107.4368 3115.7710 3133.3924 3142.2061 3148.0109 3160.9429 3309.4359 3369.6760 3426.1308 3510.5733 3524.5257 3611.6249
redmass: 1.7427 8.3625 9.5537 7.1281 6.4147 4.9785 9.9744 6.6707 7.5320 3.8882 4.1825 7.2481 4.7644 4.8596 4.0184 6.3644 3.3989 3.4534 3.3634 3.0938 4.5617 1.6136 3.0523 1.6737 2.4078 4.1194 1.9708 9.1355 4.6781 2.0164 11.6788 6.9877 5.8967 1.1593 5.5527 6.4645 1.4504 5.8835 2.3939 1.2850 1.4714 5.0632 1.4498 3.6663 1.5091 6.8563 1.3719 6.6601 1.3558 2.9984 7.2841 3.3680 2.3213 2.9865 1.8428 4.0315 1.3423 1.4149 1.4770 1.5802 2.6678 2.9870 1.4319 1.6184 1.6979 2.4068 1.5685 1.5600 1.5941 3.3278 2.2194 1.8953 7.0641 9.6946 3.4740 4.3049 4.5361 5.7126 1.0851 1.0860 1.0971 1.0982 1.0913 1.0916 1.0645 1.0762 1.0785 1.0773 1.0782 1.0817
irintensity: 71.8508 0.9008 2.7007 1.2784 2.3772 1.3797 7.7369 7.4985 2.5729 0.2473 4.6090 9.3906 4.3224 5.4973 6.4179 3.8938 13.3851 17.8126 43.3037 30.6573 3.0255 0.2617 107.5078 138.6388 106.0030 25.1917 77.6258 8.4725 47.2276 278.8255 23.3187 0.7867 11.8476 5.8158 32.3083 68.6120 129.4598 29.3063 29.0511 23.8382 7.9038 19.3128 9.8629 25.3086 173.8546 354.8161 1.6134 30.9234 0.3900 5.2889 239.4858 657.7377 30.7591 305.1456 338.3065 639.1798 52.3079 118.6116 172.5709 19.7394 359.5783 19.5529 31.3185 191.9319 197.7003 6.3433 37.7336 96.2890 96.9605 1.3234 36.8317 70.1630 21.0410 430.6995 175.6797 85.0620 142.4803 508.3971 1.8884 0.9279 31.8314 14.4693 6.2451 11.6856 26.3456 11.9681 66.7156 93.9124 76.9770 101.1288
temp: 298.150 k
press: 1.00000 atm
elementType: 8 8 8 8 7 7 7 7 7 7 6 6 6 6 6 6 6 6 6 6 1 1 1 1 1 1 1 1 1 1 1 1
symmnumber: 1
zpe: 602216.1 jmol-1
zpe.correction: 0.229372 hartree
zpe.thermalcorrener: 0.249489 hartree
zpe.thermalcorrenthalpy: 0.250433 hartree
zpe.thermalcorrgfe: 0.176842 hartree
zpe.sumelectzpe: -1015.988919 hartree
zpe.sumelectthermal: -1015.968803 hartree
zpe.sumelectthermalent: -1015.967858 hartree
zpe.sumelectthermalfe: -1016.041449 hartree
dipole: -12.0076 4.0989 -3.7523
dipole: 13.2311
quadrupole: -176.3486 -115.5078 -115.7688
quadrupole: 20.6834 24.7952 3.2514
quadrupole: -40.4735 20.3672 20.1063 20.6834 24.7952 3.2514
hfenergy: -1016.2182912 hartree
pointgroup: C01 [X(C10H12N6O4)]
dipole: -4.6391502 1.8653611 -1.447814 debye
polarizability: 763.1060526|-71.9927153|151.5355547|64.5801735|10.5723797|104.1305256 unknown
InChI: InChI=1S/C10H12N6O4/c17-9(15-19)13-11-5-7-1-2-8(4-3-7)6-12-14-10(18)16-20/h1-6,11-15,19H
charge 0 multiplicity 1
32 atoms
O  -5.334839 -0.894307 1.011588
O  -8.002609 -0.716297 0.819541
O  5.19757 -2.237926 -0.369263
O  7.474515 0.105873 0.957288
N  -3.598316 -0.202966 -1.103929
N  3.654405 -0.116912 0.208237
N  -4.984887 -0.090909 -1.187949
N  5.004012 -0.075478 0.454849
N  -7.14671 -0.229052 -0.240934
N  7.187512 -1.066362 0.433728
C  -1.465386 0.813366 -0.350314
C  1.392892 0.840673 0.172577
C  -0.624592 -0.339482 -0.642252
C  -0.802246 1.980553 0.211327
C  0.73539 -0.325892 -0.393535
C  0.556343 1.991822 0.461002
C  -2.845281 0.846051 -0.576094
C  2.773917 0.903387 0.442334
C  -5.791479 -0.437495 -0.085827
C  5.748223 -1.205922 0.134267
H  -1.063716 -1.243011 -1.083177
H  -1.407394 2.865252 0.444018
H  1.317686 -1.223049 -0.63817
H  1.024512 2.886973 0.888448
H  -3.427714 1.747515 -0.362433
H  3.206152 1.815052 0.867624
H  -3.23313 -1.158773 -1.082309
H  3.401308 -1.035034 -0.193364
H  -5.376027 0.187865 -2.089674
H  5.492977 0.732523 0.866721
H  -7.685577 -0.02928 -1.081075
H  -7.323309 -0.97486 1.520347
