program: Gaussian 09
title: 000283020
version: EM64L-G09RevD.01
frameworkgroup: C1[X(C10H7ClN2O)]
method: RPBEPBE
basis: SDD
operation: Freq
keyword: #p
keyword: freq=noraman
keyword: PBEPBE/SDD
title: #p freq=noraman PBEPBE/SDD
converged: NO YES NO YES
title: Mulliken charges:
elementType: Cl O N N C C C C C C C C C C H H H H H H H
charge: -0.023996 -0.167251 -0.013295 -0.000804 0.077830 0.065860 0.087514 -0.331933 -0.306377 -0.381219 0.207984 -0.209969 -0.211147 -0.689745 0.266435 0.268415 0.288097 0.242542 0.242447 0.294300 0.294315
chargesum: 0.00000
title: Mulliken charges with hydrogens summed into heavy atoms:
elementType: Cl O N N C C C C C C C C C C
charge: -0.023996 -0.167251 -0.013295 -0.000804 0.077830 0.065860 0.087514 -0.065498 -0.037963 -0.093121 0.207984 0.032572 0.031300 -0.101131
polarizability: 2.28737014e+02 2.27379715e+01 1.33947334e+02 -3.64169954e-03 1.11034932e-03 5.33572512e+01
1716.lowfreq: -9.0967 -4.6323 -0.0020 -0.0017 0.0010 7.5156 36.6380 54.9852 87.7079
frequency: 36.6316 54.9816 87.6989 90.2275 173.8208 216.2677 240.9812 263.9495 349.9187 407.0917 455.1220 466.3000 488.3550 522.5058 563.9551 578.9335 602.6647 672.3130 706.2161 737.1701 755.2810 778.3166 804.5157 872.3829 892.0511 902.5077 935.6235 949.8264 978.6159 1003.3334 1005.1371 1011.3470 1111.2066 1133.4646 1155.9498 1191.3435 1217.5248 1252.6189 1275.0496 1295.2219 1324.6827 1372.7171 1402.2036 1412.1546 1453.4141 1475.9942 1509.0598 1548.5088 1610.9461 1619.9924 3053.2614 3122.4850 3141.2076 3154.0483 3164.2679 3168.1905 3177.7508
redmass: 6.9126 3.4910 4.5956 8.2682 4.3025 13.8403 5.7146 8.0808 7.8516 4.5275 3.2794 6.3048 4.0726 7.4139 2.9025 8.2539 9.7244 3.0304 8.3538 6.5340 6.3762 1.2963 3.0905 6.5978 1.7084 1.9334 6.2136 1.5323 1.3677 3.7735 1.3401 2.1670 1.8054 1.1134 1.2566 1.6969 2.2126 2.0816 2.3465 2.0994 3.2369 2.4831 1.1282 4.1302 2.8684 3.5997 7.7393 6.8286 7.2076 8.7617 1.0578 1.1047 1.0864 1.0898 1.0929 1.0960 1.1006
irintensity: 0.4792 7.8673 1.5045 1.0711 3.8583 1.3415 1.9930 0.2557 8.0963 11.7545 0.1884 7.9414 0.5313 0.5855 0.5404 8.4241 1.2063 0.3164 69.0919 46.3010 0.1808 95.1768 0.2724 3.1487 1.3238 12.7481 20.6405 7.3025 5.6437 32.9726 0.0160 27.1128 14.6906 0.6715 1.3257 23.8922 26.6613 14.9757 0.7928 56.0710 0.2636 4.9443 34.3596 10.4298 15.4161 20.0480 8.0852 24.8677 40.1490 57.0867 18.7084 1.0549 2.2558 4.7878 0.1838 8.9967 20.3849
temp: 298.150 k
press: 1.00000 atm
elementType: 17 8 7 7 6 6 6 6 6 6 6 6 6 6 1 1 1 1 1 1 1
symmnumber: 1
zpe: 388471.2 jmol-1
zpe.correction: 0.147961 hartree
zpe.thermalcorrener: 0.159415 hartree
zpe.thermalcorrenthalpy: 0.160359 hartree
zpe.thermalcorrgfe: 0.108624 hartree
zpe.sumelectzpe: -1029.065923 hartree
zpe.sumelectthermal: -1029.054469 hartree
zpe.sumelectthermalent: -1029.053525 hartree
zpe.sumelectthermalfe: -1029.105261 hartree
dipole: -5.8025 -2.9265 0.0005
dipole: 6.4987
quadrupole: -89.5550 -87.4771 -87.8903
quadrupole: 1.6337 0.0011 0.0002
quadrupole: -1.2476 0.8304 0.4172 1.6337 0.0011 0.0002
hfenergy: -1029.2138842 hartree
pointgroup: C01 [X(C10H7Cl1N2O1)]
dipole: -2.3642014 -0.9735209 -0.0002154 debye
dipolederiv: -0.5941195 0.1380409 0.0008057 0.0921232 -0.1295894 -0.0000498 0.0007132 -0.0001095 -0.1439992 -0.849584 -0.1468292 0.0001921 -0.1826289 -0.6557009 -0.0007545 0.0000054 -0.0008766 -0.2739761 0.1224222 0.0702768 -0.00016 0.2211909 -0.231749 -0.0002202 0.0002725 -0.0000644 -0.2285084 -0.2038977 -0.020303 -0.0001198 0.0904276 -0.1848044 0.0001436 0.0001876 0.0002363 -0.2669735 -0.2868551 -0.0230775 0.0003245 0.5265932 0.0557291 -0.0006816 0.0018201 -0.000154 0.1201557 0.3394349 0.255741 0.0004813 -0.3652074 -0.1353505 -0.0003349 -0.0012397 -0.0009279 0.1139868 -0.5360106 0.0031626 0.0006123 -0.2428381 -0.1086917 -0.0003454 -0.0000392 -0.0005945 0.1074961 -0.0083614 -0.0949808 -0.0004054 0.0090783 0.0846928 0.000655 -0.0001166 0.0007549 -0.1544323 -0.174153 -0.1605434 -0.0004157 -0.1719464 0.0694586 0.0007547 -0.0004384 0.0007433 -0.1450666 -0.1149989 0.0295708 0.0002189 0.1438693 0.2429024 0.0004269 0.0005664 0.00054 0.0366045 1.4629258 0.0345734 -0.0011663 -0.4185967 0.9166423 0.0023809 -0.0022458 0.0020056 0.1146899 -0.1125467 0.1316017 0.0003361 0.2089326 0.1283044 0.000525 0.0005537 0.0005967 -0.1359749 0.1919844 -0.0587282 -0.0004735 -0.1012153 -0.022269 0.0003895 -0.0005851 0.0003497 -0.1285243 0.7534107 -0.1205574 -0.0009374 0.2261924 -0.3066029 -0.0013258 -0.0002191 -0.0009317 0.150606 0.0764887 0.0760699 0.0002959 0.0171859 -0.0206437 -0.0005261 0.0001318 -0.0005825 0.1638526 0.0607056 0.0225583 0.000162 0.0825998 -0.0109882 -0.0005602 0.00033 -0.0005016 0.163735 0.074945 -0.0626631 -0.00012 -0.0501445 0.0605249 -0.0001417 -0.0001002 -0.0001258 0.1290532 0.0123964 -0.0927509 -0.0001105 -0.1013523 -0.0314144 -0.000431 -0.0001354 -0.0004408 0.1611968 -0.1062515 0.0192286 0.0003109 0.0157541 0.0939087 -0.0001965 0.0002993 -0.0001985 0.159776 -0.0538745 -0.0002882 0.0611699 -0.000117 0.0926282 0.0342035 0.0622021 0.0430798 0.0282003 -0.0540609 -0.0001022 -0.061001 0.0000994 0.0930125 -0.0339114 -0.0619625 -0.0427984 0.0281025 unknown
polarizability: 231.6488771|15.2485283|131.0348154|-0.1292214|0.1962028|53.3579071 unknown
InChI: InChI=1S/C10H7ClN2O/c11-5-10(14)9-6-12-7-3-1-2-4-8(7)13-9/h1-4,6H,5H2
charge 0 multiplicity 1
21 atoms
Cl 4.922583 -1.310829 -0.009451
O  3.323454 1.260815 -0.001187
N  0.320578 -0.720083 -0.003705
N  -0.844443 1.91984 0.004677
C  -1.055374 -0.552986 -0.00192
C  -1.642931 0.776276 0.002307
C  1.072575 0.404646 -0.001346
C  -1.905313 -1.702074 -0.00425
C  -3.062602 0.915336 0.004076
C  0.485843 1.723069 0.002837
C  2.573079 0.252114 -0.003207
C  -3.292869 -1.536489 -0.002435
C  -3.872391 -0.225374 0.001732
C  3.070662 -1.194632 -0.007238
H  -1.437967 -2.691492 -0.007437
H  -3.479916 1.92672 0.007264
H  1.137971 2.601257 0.00461
H  -3.948672 -2.413454 -0.004207
H  -4.96261 -0.121181 0.003075
H  2.700381 -1.727063 0.88269
H  2.698464 -1.722811 -0.898885
