program: Gaussian 09
title: 000283149
version: EM64L-G09RevD.01
frameworkgroup: C1[X(C23H20BrNO3S)]
method: RPBEPBE
basis: SDD
operation: Freq
keyword: #p
keyword: freq=noraman
keyword: PBEPBE/SDD
title: #p freq=noraman PBEPBE/SDD
converged: YES YES NO NO
title: Mulliken charges:
elementType: Br S O O O N C C C C C C C C C C C C C C C C C C C C C C C H H H H H H H H H H H H H H H H H H H H
charge: 0.020215 0.881530 -0.288480 -0.544140 -0.544685 -0.125488 -0.015189 0.302940 0.282391 0.196970 -0.445256 0.218657 -0.143539 -0.283528 -0.307674 -0.379740 -0.338223 -0.224480 -0.268772 -0.219733 -0.232918 -0.256211 -0.254717 0.450898 -0.380770 -0.356220 -0.258703 -0.801507 -0.664688 0.275684 0.311841 0.262819 0.249615 0.268510 0.262402 0.281104 0.283478 0.238479 0.239246 0.239482 0.238506 0.225257 0.228812 0.242436 0.226452 0.227382 0.215543 0.241106 0.222904
chargesum: 0.00000
title: Mulliken charges with hydrogens summed into heavy atoms:
elementType: Br S O O O N C C C C C C C C C C C C C C C C C C C C C C C
charge: 0.020215 0.881530 -0.288480 -0.544140 -0.544685 -0.125488 -0.015189 0.302940 0.282391 0.196970 -0.169572 0.218657 -0.143539 0.028314 -0.044855 -0.130125 -0.069713 0.037922 -0.268772 0.061372 0.050560 -0.017732 -0.015471 0.450898 -0.141288 -0.117714 0.195366 -0.105237 0.014865
polarizability: 4.18657519e+02 -8.29746111e+00 4.17508829e+02 1.34583455e+01 4.15451572e+01 3.37124704e+02
1716.lowfreq: -13.5111 -0.0009 0.0006 0.0008 2.8086 3.4855 5.7917 6.4920 22.8964
frequency: -9.6263 6.0745 22.4469 27.5882 30.1365 36.4140 42.7639 48.4935 63.4360 80.9147 87.6416 98.6601 107.9766 115.5149 118.7483 145.5873 162.7451 181.6015 212.8727 216.8819 228.4771 241.0577 270.0570 275.9310 288.0932 289.6517 320.5280 340.3174 360.9753 368.6314 372.5509 388.0724 399.9827 406.5414 422.0069 428.4466 461.1323 502.1132 512.3231 539.2358 553.9160 573.0529 580.8047 604.4725 616.4202 619.3870 619.9303 671.0225 690.4803 708.3883 731.0314 756.8298 763.6959 768.2097 774.5305 776.1022 803.7748 812.6080 821.4765 831.2782 839.1762 845.5080 877.9640 878.3126 896.2622 906.6891 960.0530 963.8512 968.3973 978.1016 986.3763 990.4083 995.1331 999.0989 1013.3283 1040.7257 1041.6540 1048.1543 1063.4262 1084.0198 1106.7907 1112.3896 1114.1712 1129.6035 1132.8812 1155.8472 1179.2553 1182.8472 1201.5175 1215.7149 1238.8572 1250.5767 1268.6778 1278.2198 1290.9678 1340.6258 1349.1267 1357.0203 1376.9724 1378.1523 1387.3897 1390.7816 1396.1783 1396.8850 1398.3130 1423.1185 1452.6079 1458.9332 1466.8992 1471.2686 1473.3028 1476.6916 1482.5965 1484.4909 1492.5571 1528.7374 1567.3807 1577.6402 1587.8837 1591.8049 1597.2874 2978.3810 2982.5852 2997.0327 3042.7468 3060.0451 3089.2574 3094.0336 3106.3973 3121.9069 3128.6251 3131.0310 3137.2863 3149.4942 3157.3334 3160.0441 3161.5397 3167.4951 3168.0873 3174.4758 3185.3229
redmass: 5.8981 5.6902 3.0883 5.0279 4.7504 1.0493 5.1953 5.1594 3.5026 5.5994 5.4238 6.6884 3.4504 7.4553 5.1012 5.8741 11.2636 3.7672 7.3163 6.2158 1.6246 2.7935 5.3515 5.3352 4.5083 5.0375 5.6008 5.5635 10.5283 3.4576 5.7537 5.0810 6.2572 2.8666 3.5954 4.9579 4.8584 3.0935 5.1965 3.9133 5.4226 5.7866 4.3345 5.2747 6.6726 4.9698 6.9320 5.9430 5.4559 3.3148 3.2141 8.4577 4.0291 5.8723 3.7758 1.4964 1.1820 4.4920 1.3523 1.5961 3.9693 1.2535 12.8807 1.4059 1.4363 1.5637 1.3020 1.3747 1.4059 1.3876 1.5586 4.0975 3.5092 1.6372 2.3800 4.7544 2.6757 1.5858 2.1453 2.7545 2.1529 1.2832 2.0360 1.8186 1.7376 1.9726 1.1439 1.1106 2.5756 2.9839 2.0242 1.1617 1.4053 1.7594 1.2720 2.9721 4.0125 1.3296 5.5115 2.3353 3.1669 3.3133 1.2604 5.2397 1.2299 2.3760 2.4402 1.0411 2.3873 1.0826 1.0675 1.0924 1.7572 3.0869 1.5815 7.2428 6.6237 6.5151 6.8317 5.9779 5.7106 1.0386 1.0557 1.0368 1.1078 1.0952 1.0998 1.0992 1.1014 1.0885 1.0891 1.0892 1.0855 1.0895 1.0948 1.0963 1.0939 1.0894 1.0915 1.0997 1.0981
irintensity: 0.7873 0.1192 0.8650 0.7630 0.6827 0.3173 0.9754 0.4229 9.4740 9.6686 0.9654 2.0137 0.9141 5.6917 0.3353 11.1629 7.8424 1.1651 7.7781 4.5203 2.2735 1.4770 2.3836 4.5112 2.9300 1.2289 4.5372 8.4639 17.8485 0.9531 9.2861 20.2912 81.6977 0.3393 17.1313 8.9638 3.1005 108.3659 11.1006 29.3015 4.4550 11.9888 8.1979 7.7116 5.5118 10.9133 0.1031 16.9577 2.5524 1.0275 6.8646 105.4660 8.1053 64.1732 34.2320 36.3905 5.4755 32.3253 19.5145 39.2546 39.4622 0.1958 30.1447 6.7482 11.2311 9.8239 0.9005 3.2632 1.3113 0.0045 0.8252 15.5894 24.2589 9.7531 90.8303 138.7993 16.4716 26.3611 51.0494 77.0245 7.9747 8.8222 60.2848 1.6586 1.3448 28.8573 36.3083 11.4336 212.5669 11.0624 19.8090 0.2175 9.4481 16.6048 2.5643 8.8811 15.7405 32.0604 0.4644 2.7996 6.9552 19.1258 41.4304 8.1349 13.8612 9.7359 38.4145 12.2526 34.9727 13.3682 11.3251 19.3221 52.3384 72.3922 58.0635 77.1610 17.5800 54.7889 0.1703 9.1411 5.4828 33.4467 40.0425 27.6933 17.6881 14.9490 15.1489 32.0186 27.0234 8.7471 15.0290 12.5597 0.5677 7.1353 1.7155 18.8567 9.3386 1.8705 2.5961 24.2001 3.0080
temp: 298.150 k
press: 1.00000 atm
elementType: 35 16 8 8 8 7 6 6 6 6 6 6 6 6 6 6 6 6 6 6 6 6 6 6 6 6 6 6 6 1 1 1 1 1 1 1 1 1 1 1 1 1 1 1 1 1 1 1 1
symmnumber: 1
zpe: 960797.3 jmol-1
zpe.correction: 0.365948 hartree
zpe.thermalcorrener: 0.393655 hartree
zpe.thermalcorrenthalpy: 0.394599 hartree
zpe.thermalcorrgfe: 0.302779 hartree
zpe.sumelectzpe: -1578.157146 hartree
zpe.sumelectthermal: -1578.129439 hartree
zpe.sumelectthermalent: -1578.128495 hartree
zpe.sumelectthermalfe: -1578.220316 hartree
dipole: 0.4532 4.1942 8.3915
dipole: 9.3922
quadrupole: -189.3329 -157.8622 -190.1046
quadrupole: -3.2677 -20.6095 -11.8103
quadrupole: -10.2330 21.2377 -11.0047 -3.2677 -20.6095 -11.8103
hfenergy: -1578.5230946 hartree
pointgroup: C01 [X(C23H20Br1N1O3S1)]
dipole: 1.7009689 0.7969849 -3.1821219 debye
polarizability: 415.9332128|4.2586445|418.3485503|-42.6145919|17.0474715|339.0092888 unknown
InChI: InChI=1S/C16H13BrNO.C7H7O2S/c1-2-19-16-10-18-15-8-7-11(17)9-14(15)12-5-3-4-6-13(12)16;1-6-2-4-7(5-3-6)10(8)9/h3-10H,2H2,1H3;2-5H,1H3
charge 0 multiplicity 1
49 atoms
Br -0.197596 6.031457 1.584429
S  -1.7038 -1.177895 2.100199
O  3.259065 -1.769971 0.54674
O  -2.62244 -0.282283 3.142445
O  -1.347144 -2.756601 2.415355
N  0.449397 -0.072495 2.199737
C  0.27703 1.280493 1.847281
C  0.750693 1.975379 0.674548
C  1.319632 1.320896 -0.54258
C  2.076834 0.095414 -0.548781
C  1.4012 -0.924019 1.714955
C  2.251623 -0.790709 0.611673
C  -2.69531 -1.201204 0.475479
C  -0.42939 2.008711 2.857014
C  0.609565 3.39356 0.654084
C  1.118661 1.974573 -1.793661
C  2.627869 -0.375515 -1.782056
C  -0.615066 3.396967 2.785911
C  -0.054964 4.079133 1.683933
C  -3.569411 -0.134226 0.207978
C  -2.511998 -2.280626 -0.406113
C  1.663986 1.493876 -2.998335
C  2.43878 0.311063 -2.990929
C  -4.145755 -1.22789 -1.928232
C  -4.294336 -0.159394 -1.004712
C  -3.249033 -2.283452 -1.610744
C  4.677501 -1.28617 0.549672
C  -4.955529 -1.263215 -3.212106
C  5.55821 -2.488612 0.22762
H  1.542593 -1.831626 2.315819
H  -0.815766 1.42996 3.700393
H  1.041767 3.966726 -0.16985
H  0.48441 2.865121 -1.829076
H  3.162548 -1.330072 -1.772222
H  -1.154415 3.931952 3.571592
H  -3.698066 0.669895 0.939979
H  -1.838097 -3.10121 -0.138745
H  1.470669 2.027294 -3.934779
H  2.860266 -0.086132 -3.920079
H  -4.988539 0.658341 -1.231598
H  -3.13007 -3.119769 -2.310015
H  4.795801 -0.472759 -0.191868
H  4.88548 -0.883585 1.55978
H  -5.862931 -1.885357 -3.086912
H  -5.287302 -0.254239 -3.511931
H  -4.375946 -1.696588 -4.046319
H  6.62365 -2.198493 0.271529
H  5.386865 -3.299406 0.955559
H  5.343809 -2.878801 -0.782361
