program: Gaussian 09
title: 000283053
version: EM64L-G09RevD.01
frameworkgroup: C1[X(C23H18O2)]
method: RPBEPBE
basis: SDD
operation: Freq
keyword: #pfreq=noraman
keyword: PBEPBE/SDD
title: #p freq=noraman PBEPBE/SDD
converged: YES YES NO NO
title: Mulliken charges:
elementType: O O C C C C C C C C C C C C C C C C C C C C C C C H H H H H H H H H H H H H H H H H H
charge: -0.156886 -0.228121 0.167595 0.245107 0.175653 0.277357 0.200089 -0.322936 0.055639 -0.016156 0.340759 0.343402 -0.438369 -0.364561 -0.360020 -0.431047 -0.250118 0.479523 -0.610796 -0.618221 -0.248268 -0.227179 -0.851906 -0.827691 -0.813980 0.286725 0.268119 0.317423 0.281055 0.242116 0.240023 0.240692 0.233185 0.236698 0.237698 0.233893 0.255101 0.226287 0.223736 0.267666 0.236201 0.227048 0.227466
chargesum: 0.00000
title: Mulliken charges with hydrogens summed into heavy atoms:
elementType: O O C C C C C C C C C C C C C C C C C C C C C C C
charge: -0.156886 -0.228121 0.167595 0.245107 0.175653 0.277357 0.200089 -0.322936 0.055639 -0.016156 0.340759 0.343402 -0.151644 -0.096442 -0.042598 -0.149993 -0.008002 0.479523 -0.370773 -0.377528 -0.015083 0.009519 -0.125214 -0.110003 -0.123265
polarizability: 3.82259969e+02 2.03575615e+01 2.61779983e+02 -1.54311065e+01 -8.90457723e-01 1.66415124e+02
1716.lowfreq: -1.8976 0.0005 0.0008 0.0009 0.8705 4.6224 7.0031 18.1616 31.1897
frequency: 3.4745 18.0002 31.1731 38.3944 61.2385 102.3896 110.6975 123.5745 127.3461 141.8799 150.7770 155.5039 190.0612 207.8269 223.3460 230.8024 267.1882 272.9317 279.2713 287.3502 323.1541 357.3538 407.8227 416.7528 443.2333 446.5217 484.8612 501.5932 519.3759 521.2758 529.1274 544.2551 560.2888 563.5450 581.9275 613.4387 640.0079 667.5945 674.0110 728.5841 743.3017 756.6924 767.2524 778.4462 792.1219 810.9480 861.5878 867.4388 893.3857 898.4319 916.4049 935.4739 952.0976 959.1511 980.6451 983.7340 991.8614 999.6349 1005.0786 1016.9700 1019.1087 1029.6514 1041.2701 1044.7421 1046.0767 1050.9520 1078.2923 1086.4925 1139.0183 1168.3645 1171.8586 1183.6932 1200.5006 1210.0165 1243.3105 1253.9693 1268.4573 1294.3360 1312.9325 1357.0632 1368.1967 1391.0840 1396.9541 1399.9399 1402.1542 1413.8258 1425.6910 1438.4837 1450.4198 1458.0374 1465.0097 1466.3917 1470.5678 1472.8654 1473.3446 1480.4307 1490.4912 1540.1722 1573.7425 1581.7293 1589.4546 1603.8924 1613.0281 1616.0138 1632.9617 2975.3984 2981.7208 2986.0391 3056.9608 3061.5338 3068.7939 3084.8320 3086.7147 3090.8642 3115.5452 3119.6070 3133.8956 3138.0110 3148.0611 3149.9387 3164.8368 3167.6257 3192.3382
redmass: 1.0153 5.4731 4.0179 4.8210 5.4122 2.0273 4.3907 1.2924 1.2985 5.1877 3.9473 5.9609 3.2025 4.1139 2.8075 5.9330 4.0587 3.7708 5.2917 4.8730 3.2345 5.8650 3.8569 5.6094 3.9962 4.3152 4.0429 4.8254 3.9264 3.8374 4.4219 6.4325 4.5077 3.3233 5.3051 4.2759 5.8292 6.4988 4.9688 3.9969 5.9079 1.4489 6.6606 4.0327 1.5858 3.7825 2.8531 1.3313 6.1582 1.3148 1.4663 2.4106 3.3799 1.4569 1.5767 4.3599 6.8027 1.3930 1.3834 1.6109 1.6686 2.0502 1.6405 1.5997 1.5650 1.6307 2.0547 1.9155 3.5804 1.3137 1.4229 1.8554 1.9561 2.0407 1.9687 1.5848 3.8838 1.5576 6.6989 7.4148 9.2773 2.4070 1.2287 1.3598 1.2224 2.1926 2.9046 2.1090 2.6672 2.7549 1.2532 2.5800 1.0694 1.0911 1.0672 1.1456 1.3765 8.9302 7.1123 7.8237 7.0742 7.6870 7.2191 5.8441 10.8562 1.0388 1.0372 1.0373 1.0946 1.0972 1.0964 1.0992 1.0999 1.1002 1.0909 1.0919 1.0863 1.0865 1.0917 1.0917 1.0989 1.0994 1.0949
irintensity: 0.4672 0.5728 0.3535 0.8026 5.7886 1.5537 1.4666 0.3968 1.0691 0.6842 1.3872 0.1694 4.0614 2.0025 0.1865 0.0341 7.5323 5.6488 2.3631 0.7698 0.1296 0.5478 1.5378 0.9471 4.7103 2.4646 2.0359 1.5131 11.2272 0.2640 0.1964 5.1008 2.3028 0.5604 5.5414 8.4450 0.5119 6.3815 10.9569 6.9460 17.0811 116.7713 9.8543 21.4659 0.1310 3.8131 15.4629 25.5296 23.1464 0.1616 0.4704 2.8275 4.7841 2.0115 12.9030 69.7960 24.5214 1.5332 0.1603 1.4117 4.6273 1.2846 1.7881 10.0407 0.1008 25.0000 5.5259 11.9327 16.7221 6.1600 12.3306 14.3460 8.1908 19.2102 154.2376 6.9459 98.2825 10.3017 13.7685 0.7087 10.2380 20.7082 13.9593 23.1493 2.4842 3.0889 57.0679 76.7503 0.0957 36.7742 27.3521 10.9370 5.0749 24.0017 7.5828 34.7859 9.4906 91.0561 86.3336 85.0595 6.2232 55.0055 77.3782 61.8972 125.3160 37.7106 23.3515 19.8154 20.7261 11.9539 16.6144 23.0600 16.2535 21.3166 26.1246 20.2734 3.0077 1.2296 8.5565 1.9436 32.3955 13.3323 16.1956
temp: 298.150 k
press: 1.00000 atm
elementType: 8 8 6 6 6 6 6 6 6 6 6 6 6 6 6 6 6 6 6 6 6 6 6 6 6 1 1 1 1 1 1 1 1 1 1 1 1 1 1 1 1 1 1
symmnumber: 1
zpe: 882822.0 jmol-1
zpe.correction: 0.336249 hartree
zpe.thermalcorrener: 0.358235 hartree
zpe.thermalcorrenthalpy: 0.359179 hartree
zpe.thermalcorrgfe: 0.281633 hartree
zpe.sumelectzpe: -1036.010165 hartree
zpe.sumelectthermal: -1035.988179 hartree
zpe.sumelectthermalent: -1035.987235 hartree
zpe.sumelectthermalfe: -1036.064781 hartree
dipole: 3.8999 0.0741 0.8059
dipole: 3.9830
quadrupole: -138.3550 -140.7135 -142.2316
quadrupole: 17.8613 -2.0058 -2.5030
quadrupole: 2.0784 -0.2801 -1.7982 17.8613 -2.0058 -2.5030
hfenergy: -1036.3464137 hartree
pointgroup: C01 [X(C23H18O2)]
dipole: 1.5395484 -0.0792198 0.2812482 debye
polarizability: 380.4218256|30.0518694|241.8272951|-6.1510263|39.6707326|188.2059564 unknown
InChI: InChI=1S/C23H18O2/c1-13-11-14(2)20(15(3)12-13)23(25)19-10-6-9-18-21(19)16-7-4-5-8-17(16)22(18)24/h4-12H,1-3H3
charge 0 multiplicity 1
43 atoms
O  -4.700045 1.677997 1.159772
O  0.52798 -1.190904 -1.559171
C  -1.502199 0.429585 0.012226
C  -2.419153 -0.724099 -0.286829
C  -2.300092 1.469991 0.589862
C  -0.09755 0.647619 -0.107465
C  -3.739383 -0.370401 0.143062
C  -3.728431 1.016706 0.697114
C  2.334262 -0.243361 -0.279152
C  0.88316 -0.330059 -0.695654
C  2.711154 -0.453772 1.083258
C  3.331498 -0.02945 -1.280749
C  -1.781034 2.703515 1.001967
C  0.424156 1.909403 0.326029
C  -2.213325 -1.989073 -0.874704
C  -4.831738 -1.241183 0.019905
C  -0.390268 2.928518 0.855054
C  5.089894 -0.177406 0.455188
C  4.085065 -0.425939 1.420862
C  4.689825 0.014807 -0.889571
C  -3.315581 -2.878482 -0.991129
C  -4.611409 -2.519347 -0.551158
C  1.688496 -0.754056 2.169786
C  2.967315 0.158323 -2.74488
C  6.553558 -0.107584 0.8519
H  -2.449683 3.457972 1.429703
H  1.501738 2.079285 0.229023
H  -1.232217 -2.265696 -1.262785
H  -5.823625 -0.925643 0.360138
H  0.05487 3.88166 1.15761
H  4.376143 -0.608758 2.463046
H  5.454123 0.195984 -1.655702
H  -3.154916 -3.862695 -1.44542
H  -5.441868 -3.224838 -0.661483
H  0.965999 -1.529136 1.855711
H  2.189823 -1.113485 3.08444
H  1.100639 0.142387 2.440471
H  2.172952 0.915285 -2.881997
H  3.84722 0.477362 -3.328787
H  2.581456 -0.781656 -3.176743
H  6.837355 0.9236 1.139952
H  6.771014 -0.759843 1.715843
H  7.213622 -0.408335 0.019553
