program: Gaussian 09
title: 000283003
version: EM64L-G09RevD.01
frameworkgroup: C1[X(C8H6BrClO2)]
method: RPBEPBE
basis: SDD
operation: Freq
keyword: #p
keyword: freq=noraman
keyword: PBEPBE/SDD
title: #p freq=noraman PBEPBE/SDD
converged: NO NO NO NO
title: Mulliken charges:
elementType: Br Cl O O C C C C C C C C H H H H H H
charge: 0.022580 0.016883 -0.450611 -0.217026 0.567332 0.358000 -0.373576 -0.394765 -0.249919 -0.300361 -0.808481 0.115970 0.268366 0.304263 0.258556 0.258564 0.233196 0.391030
chargesum: 0.00000
title: Mulliken charges with hydrogens summed into heavy atoms:
elementType: Br Cl O O C C C C C C C C
charge: 0.022580 0.016883 -0.059581 -0.217026 0.567332 0.358000 -0.373576 -0.126399 0.054344 -0.300361 -0.058165 0.115970
polarizability: 1.84989048e+02 -9.91074074e-01 1.31547348e+02 7.99490667e-03 6.89545870e-03 4.80852608e+01
1716.lowfreq: -3.7482 -0.0025 -0.0023 -0.0017 4.5307 5.2919 40.7201 60.9579 118.4561
frequency: 40.4851 60.9469 118.4528 138.1331 148.2222 195.8600 214.5140 229.1785 253.6812 317.6679 337.1599 363.1039 439.1535 477.4926 532.7527 551.1623 589.8299 601.5063 679.6353 686.3245 712.2910 752.7697 881.5512 889.4922 929.5980 989.8217 1013.2325 1045.4470 1054.4830 1151.5569 1218.9812 1262.4778 1301.3819 1332.2251 1369.5591 1401.0757 1459.7900 1459.8913 1468.7999 1536.5163 1596.7839 1650.0612 2983.6542 3062.4179 3097.0233 3157.5428 3192.2915 3539.2267
redmass: 13.5426 6.9578 4.8761 11.0625 1.0687 13.8819 3.7764 5.5389 8.2439 6.5403 11.4690 5.9725 2.8520 5.0503 5.0075 2.4572 6.2863 1.6659 6.9721 4.0850 5.1469 5.2964 1.3664 7.9172 1.4595 2.8179 1.8974 1.5485 3.1957 1.6886 3.2705 1.2703 2.5461 4.7138 9.4871 1.2285 1.7977 1.1009 1.5087 6.0426 7.8129 9.1303 1.0373 1.0968 1.0999 1.0922 1.0923 1.0643
irintensity: 1.0332 0.9490 0.8364 0.5710 0.2349 0.9033 0.1316 0.9403 0.2874 0.0602 2.8529 2.1386 25.4066 11.3055 36.1272 22.2038 32.0679 117.1661 2.6535 18.0057 27.6007 12.3981 11.8183 18.8717 14.8545 184.4595 143.8114 12.6641 96.6372 97.4772 1.3573 6.2248 81.7449 24.8461 19.3735 14.3748 13.2173 14.6625 76.6392 16.4411 51.7622 283.8374 10.1334 8.6812 16.9112 1.7667 4.2317 53.5327
temp: 298.150 k
press: 1.00000 atm
elementType: 35 17 8 8 6 6 6 6 6 6 6 6 1 1 1 1 1 1
symmnumber: 1
zpe: 313931.2 jmol-1
zpe.correction: 0.119570 hartree
zpe.thermalcorrener: 0.131384 hartree
zpe.thermalcorrenthalpy: 0.132328 hartree
zpe.thermalcorrgfe: 0.079763 hartree
zpe.sumelectzpe: -931.563293 hartree
zpe.sumelectthermal: -931.551479 hartree
zpe.sumelectthermalent: -931.550535 hartree
zpe.sumelectthermalfe: -931.603100 hartree
dipole: 2.3242 0.7072 0.0021
dipole: 2.4294
quadrupole: -96.6223 -71.0899 -86.9444
quadrupole: 7.1223 -0.0061 -0.0019
quadrupole: -11.7368 13.7957 -2.0589 7.1223 -0.0061 -0.0019
hfenergy: -931.6828632 hartree
pointgroup: C01 [X(C8H6Br1Cl1O2)]
dipole: -0.9411695 0.1664929 -0.0051635 debye
dipolederiv: -0.3746701 0.3105692 0.0090977 0.3606375 -0.3873656 -0.0114344 0.0115636 -0.0122639 -0.0230231 -0.3063195 0.3366214 0.0111705 0.3528904 -0.5251441 -0.0177395 0.0118057 -0.0177898 -0.0221415 -0.4157757 -0.2405874 -0.0108532 -0.4212774 -1.2357581 -0.0435827 -0.0196767 -0.0415243 -0.4322119 -1.101938 0.1574007 -0.0038101 0.0310477 -0.5750888 -0.012347 -0.0106584 -0.0101644 -0.3076035 0.3470089 0.3010516 0.0177915 0.1465533 -0.0090783 -0.0007521 0.0109676 0.0013194 0.0513488 -0.8050351 -0.1416519 -0.0187132 -0.1777273 -0.2583038 -0.0164499 -0.019992 -0.0159932 0.0439034 0.4281444 -0.8013822 -0.0279502 -0.8497396 0.5258625 0.0195968 -0.0303382 0.0206043 -0.1707548 -0.4503293 0.120587 0.0006787 0.2242488 -0.1035276 0.003821 0.0054415 0.002329 -0.1172995 0.0261407 0.241013 0.0120144 0.0858615 -0.2087958 -0.0062239 0.0047672 -0.0039344 -0.0450624 0.6602741 -0.5790555 -0.0160038 -0.2352247 0.8045359 0.0355474 -0.0003294 0.0305231 -0.0551187 -0.270876 -0.0446897 -0.0062875 0.044797 0.1082299 0.0041378 -0.0022277 0.002648 0.0311641 1.8080433 0.295961 0.0360566 0.4283497 1.4810086 0.0644872 0.0431121 0.0626251 0.2404163 0.058761 -0.0198074 -0.002287 -0.0330769 -0.0317105 -0.0090128 -0.002939 -0.0088089 0.1570924 0.1454489 0.0071685 0.0001521 0.0034711 0.0469603 -0.0050202 0.0000592 -0.0050605 0.1593624 0.0159076 -0.0061711 0.0546947 -0.0063011 0.0797337 -0.0737276 0.0844959 -0.0437515 -0.0164923 0.0196672 -0.0025848 -0.0542691 -0.0009695 0.0685587 0.0813062 -0.0840537 0.0515355 -0.0093203 0.0879277 0.0407039 0.0014476 -0.0705932 -0.1364368 -0.0121341 -0.0034903 -0.0105731 0.1136382 0.1276198 0.0248537 -0.0029297 0.1170528 0.35632 -0.000472 0.0014924 -0.0017203 0.4021026 unknown
polarizability: 173.199765|-22.2206358|143.1442905|0.78281|3.9935788|48.2776009 unknown
InChI: InChI=1S/C8H6BrClO2/c1-4-2-7(10)5(8(11)12)3-6(4)9/h2-3,11H,1H3
charge 0 multiplicity 1
18 atoms
Br -2.856746 2.173989 0.131876
Cl 1.650605 -2.604862 -0.020131
O  2.384989 1.990972 0.200939
O  3.321828 -0.130343 0.115962
C  -1.920708 -0.613535 0.018953
C  0.871201 0.134294 0.091947
C  -1.511013 0.74566 0.085653
C  -0.888875 -1.583413 -0.010026
C  -0.159573 1.115148 0.12124
C  0.475819 -1.230771 0.024932
C  -3.371344 -1.035975 -0.020251
C  2.29448 0.583145 0.133448
H  -1.159093 -2.642724 -0.061524
H  0.133915 2.165243 0.172895
H  -3.91317 -0.678236 0.874878
H  -3.888282 -0.599796 -0.895118
H  -3.466005 -2.133118 -0.070354
H  3.347773 2.237024 0.226881
