program: Gaussian 09
title: 000283011
version: EM64L-G09RevD.01
frameworkgroup: C1[X(C14H9F3N2O2)]
method: RPBEPBE
basis: SDD
operation: Freq
keyword: #p
keyword: freq=noraman
keyword: PBEPBE/SDD
title: #p freq=noraman PBEPBE/SDD
converged: YES YES NO NO
title: Mulliken charges:
elementType: F F F O O N N C C C C C C C C C C C C C C H H H H H H H H H
charge: -0.136307 -0.151838 -0.156149 -0.273373 -0.267108 -0.415276 -0.061749 0.185978 0.110688 -0.213349 0.569716 0.187794 0.256987 0.179321 -0.641645 -0.421190 -0.339007 0.248377 -0.170423 -0.375147 -0.527163 0.377303 0.265657 0.285386 0.257844 0.235952 0.252992 0.297594 0.205544 0.232591
chargesum: 0.00000
title: Mulliken charges with hydrogens summed into heavy atoms:
elementType: F F F O O N N C C C C C C C C C C C C C C
charge: -0.136307 -0.151838 -0.156149 -0.273373 -0.267108 -0.037973 -0.061749 0.185978 0.110688 -0.213349 0.569716 0.187794 0.256987 0.179321 -0.375988 -0.135804 -0.081163 0.248377 0.065529 -0.122154 0.208566
polarizability: 2.23921805e+02 2.62085582e+01 2.63613513e+02 -7.53219390e-01 -3.26623377e+00 8.03007809e+01
1716.lowfreq: -1.7921 -0.0003 0.0004 0.0007 3.4194 6.2562 9.6417 28.4759 66.5430
frequency: 8.4692 28.4559 66.5306 84.9996 98.2881 102.2801 134.9468 159.5804 200.5133 212.7398 230.4583 247.8441 268.1598 293.0896 319.8399 337.4638 350.3990 374.7350 418.7999 451.9170 456.3715 466.6387 484.6365 536.7416 546.1930 581.4318 615.9217 620.7971 641.5952 646.8928 654.6622 673.8657 679.7935 760.4869 802.6536 805.6127 814.6850 815.9080 877.5590 881.9119 888.0922 924.2149 939.7637 957.0273 983.2566 991.9185 1029.2892 1046.5166 1054.1319 1078.1527 1106.8893 1121.6950 1140.2837 1158.0906 1183.7322 1222.9707 1234.8040 1266.5130 1279.7286 1314.2187 1351.9045 1380.6264 1389.9342 1416.5270 1436.3067 1445.2949 1456.5518 1473.9179 1491.8466 1519.9552 1546.4418 1547.8142 1586.9302 1611.8675 1633.2791 2978.8847 3093.4561 3127.6710 3138.9490 3146.0315 3161.2252 3173.7663 3199.1775 3375.5763
redmass: 15.1983 3.2544 4.8808 3.9446 2.0397 7.9107 4.9839 2.9710 5.9232 6.1527 5.5944 8.0621 6.0544 8.0468 5.4676 8.1648 6.5369 7.6584 7.1108 5.0628 9.7201 11.7063 7.6301 7.2028 4.1545 10.2216 4.5200 7.1360 6.9965 4.2800 8.3818 6.1169 5.3872 3.1758 1.8748 3.6604 1.6697 2.2819 5.7791 1.6109 1.6486 7.0432 1.4544 8.8371 10.2608 1.3791 3.4884 2.9869 8.7005 3.1942 1.2566 1.9965 1.9610 1.7455 1.5203 2.0216 2.4461 3.0782 2.9920 2.2803 2.9189 2.5360 2.5197 1.7906 2.2455 1.5323 1.9735 5.4484 1.0911 5.7308 4.6120 9.0007 6.1828 5.8009 8.7462 1.0318 1.1009 1.1049 1.0876 1.0926 1.0918 1.0995 1.0931 1.0781
irintensity: 0.1607 2.9393 1.1268 2.0231 0.3443 0.5903 7.7872 3.8880 5.4619 5.5238 9.1608 1.4491 3.8197 0.3266 6.4218 2.0655 2.6882 3.1541 4.7440 1.7175 1.4298 6.4872 20.7899 5.8399 6.9482 18.3464 6.1332 5.4272 0.5210 1.8617 1.3377 0.7003 3.3233 10.2487 46.1158 22.7910 2.6320 1.2796 35.4788 23.9988 100.9437 18.2888 2.8810 69.5604 245.3572 0.4938 8.8501 16.8660 183.7905 96.6610 30.0888 44.2539 7.5870 32.6066 16.0874 68.2229 218.4746 0.7411 37.1946 19.7926 66.0449 0.6333 49.8101 18.9825 29.1253 33.9309 13.8648 65.9601 85.4521 111.8631 83.9555 219.6352 13.2368 29.9309 266.7223 89.2658 29.6111 8.2341 1.7852 12.6232 2.9569 26.0646 3.5967 164.5357
temp: 298.150 k
press: 1.00000 atm
elementType: 9 9 9 8 8 7 7 6 6 6 6 6 6 6 6 6 6 6 6 6 6 1 1 1 1 1 1 1 1 1
symmnumber: 1
zpe: 540467.4 jmol-1
zpe.correction: 0.205853 hartree
zpe.thermalcorrener: 0.223251 hartree
zpe.thermalcorrenthalpy: 0.224195 hartree
zpe.thermalcorrgfe: 0.158348 hartree
zpe.sumelectzpe: -1096.902571 hartree
zpe.sumelectthermal: -1096.885173 hartree
zpe.sumelectthermalent: -1096.884229 hartree
zpe.sumelectthermalfe: -1096.950076 hartree
dipole: -4.3254 -3.2559 1.7919
dipole: 5.7027
quadrupole: -113.0240 -117.0198 -122.7187
quadrupole: 9.1144 -2.7774 8.2502
quadrupole: 4.5635 0.5677 -5.1312 9.1144 -2.7774 8.2502
hfenergy: -1097.1084242 hartree
pointgroup: C01 [X(C14H9F3N2O2)]
dipole: -1.8481709 -1.1137144 0.6146023 debye
polarizability: 230.040734|29.8267454|257.3605643|3.8133979|4.8069033|80.4348005 unknown
InChI: InChI=1S/C14H9F3N2O2/c1-21-9-5-7-3-2-4-18-12(7)13-11(9)8(20)6-10(19-13)14(15,16)17/h2-6,19H,1H3
charge 0 multiplicity 1
30 atoms
F  4.578353 -0.244891 -0.040685
F  3.533447 -1.604385 1.447633
F  3.42395 -2.068314 -0.765565
O  -1.996974 3.123808 -0.007243
O  0.981396 3.239168 -0.397503
N  0.974903 -0.870937 0.062065
N  -1.169157 -2.441696 -0.012355
C  -0.246269 -0.217257 0.016972
C  -0.341198 1.202909 -0.012769
C  -1.400759 -1.081239 -0.032551
C  -2.703331 -0.487425 -0.118029
C  -1.69023 1.766386 -0.016945
C  2.161036 -0.168685 0.051842
C  0.925608 1.983143 -0.158128
C  -2.815619 0.934152 -0.093712
C  2.168664 1.204529 -0.046482
C  -3.815499 -1.391303 -0.184861
C  3.413796 -0.994617 0.168243
C  -3.58262 -2.769763 -0.164518
C  -2.239731 -3.258505 -0.077065
C  -1.390909 4.031708 0.995804
H  0.902398 -1.902223 0.06285
H  -3.798684 1.414508 -0.108811
H  3.108272 1.758982 -0.082697
H  -4.833817 -0.992898 -0.250159
H  -4.410117 -3.48367 -0.215447
H  -2.037728 -4.334696 -0.060726
H  -0.376366 4.314094 0.676283
H  -1.374326 3.547158 1.990441
H  -2.06349 4.902753 1.01322
