program: Gaussian 09
title: 000282999
version: EM64L-G09RevD.01
frameworkgroup: C1[X(C9H7NO7)]
method: RPBEPBE
basis: SDD
operation: Freq
keyword: #pfreq=noraman
keyword: PBEPBE/SDD
title: #p freq=noraman PBEPBE/SDD
converged: YES YES NO NO
title: Mulliken charges:
elementType: O O O O O O O N C C C C C C C C C H H H H H H H
charge: -0.242103 -0.401450 -0.426645 -0.205838 -0.245169 -0.196142 -0.189530 0.021490 0.294240 0.187935 0.289881 0.208852 -0.445537 -0.499141 0.093532 0.116350 -0.522172 0.324424 0.293922 0.289655 0.222047 0.243355 0.394069 0.393975
chargesum: 0.00000
title: Mulliken charges with hydrogens summed into heavy atoms:
elementType: O O O O O O O N C C C C C C C C C
charge: -0.242103 -0.007381 -0.032669 -0.205838 -0.245169 -0.196142 -0.189530 0.021490 0.294240 0.187935 0.289881 0.208852 -0.121113 -0.205219 0.093532 0.116350 0.232884
polarizability: 2.04795424e+02 8.13402414e+00 1.53726621e+02 -2.04825388e+00 8.95913448e+00 7.05139721e+01
1716.lowfreq: -7.5556 -4.9349 -0.0003 0.0006 0.0006 3.7617 29.7637 45.1378 61.2414
frequency: 29.7185 45.1345 61.2370 88.7739 100.1044 127.3379 146.3673 168.5821 175.9055 187.4260 226.9532 260.6175 279.4177 320.1410 329.6629 360.5932 368.4462 431.9913 461.9337 501.3152 533.7550 584.3110 588.9694 603.5082 632.4735 639.4640 668.6400 693.9686 708.7219 728.6741 752.6468 769.8767 773.9099 906.6693 913.8631 959.8820 984.8300 1010.1348 1073.1745 1111.5361 1133.2079 1147.2373 1160.2470 1215.7349 1232.0280 1254.1234 1295.1988 1317.3208 1359.2126 1381.4208 1403.4713 1446.2430 1454.2578 1469.2548 1477.7750 1548.3957 1616.6791 1637.2579 1655.3997 2994.6457 3111.8180 3145.1270 3178.9202 3192.7553 3522.7821 3529.7416
redmass: 11.5310 7.8063 7.9786 4.8555 10.7570 7.7856 6.1176 6.6082 4.3262 1.5877 6.0759 4.6504 3.4994 4.7708 10.7846 6.9249 7.8468 7.8590 3.6403 3.6393 3.0449 1.5569 3.0477 2.1134 4.6740 6.7169 4.8917 6.1255 6.4451 6.2396 8.5251 5.0285 6.6855 5.8014 1.7266 1.4483 7.1724 4.6269 2.6258 1.2747 1.8712 1.4471 1.9094 6.4346 3.6583 1.4180 2.5525 3.3350 5.7009 6.5598 5.3163 1.5679 1.0764 1.0600 3.3109 8.5377 8.2103 8.2067 10.0823 1.0324 1.0999 1.1062 1.0926 1.0919 1.0642 1.0644
irintensity: 0.4927 1.2130 0.5862 2.1422 1.0564 2.9286 5.0556 4.3829 7.8458 0.3698 0.2686 3.4358 2.4190 6.8001 1.6601 10.2256 7.8106 1.1639 11.0535 44.4176 15.6915 21.2570 92.2854 94.7983 59.4816 16.2731 38.7295 23.0184 14.8555 36.8785 10.5036 9.8706 19.6963 35.5645 17.5062 31.2472 130.8616 302.6420 109.6634 4.3378 52.0223 81.2127 28.7735 408.8786 128.2452 15.9874 56.7131 83.6517 159.8117 86.6790 26.1067 53.9002 14.6772 40.8722 19.3815 106.0045 42.2646 361.0993 225.7136 44.0390 22.3560 7.5394 1.1930 10.3053 54.5772 61.5777
temp: 298.150 k
press: 1.00000 atm
elementType: 8 8 8 8 8 8 8 7 6 6 6 6 6 6 6 6 6 1 1 1 1 1 1 1
symmnumber: 1
zpe: 413853.6 jmol-1
zpe.correction: 0.157629 hartree
zpe.thermalcorrener: 0.173432 hartree
zpe.thermalcorrenthalpy: 0.174376 hartree
zpe.thermalcorrgfe: 0.113301 hartree
zpe.sumelectzpe: -927.146746 hartree
zpe.sumelectthermal: -927.130943 hartree
zpe.sumelectthermalent: -927.129998 hartree
zpe.sumelectthermalfe: -927.191074 hartree
dipole: -4.7241 -1.4422 2.7592
dipole: 5.6578
quadrupole: -90.1713 -98.2411 -100.1086
quadrupole: -9.1355 0.6532 -8.6564
quadrupole: 6.0023 -2.0674 -3.9349 -9.1355 0.6532 -8.6564
hfenergy: -927.3043749 hartree
pointgroup: C01 [X(C9H7N1O7)]
dipole: 1.7863547 -0.7034966 -1.1264192 debye
dipolederiv: -1.2883195 0.7429209 0.1721109 0.757225 -0.8414092 -0.1355839 0.0454073 0.0532821 -0.3065485 -0.6858286 0.0370227 -0.4586044 -0.0406902 -0.4189064 0.0289926 -0.5474666 -0.0557883 -0.8789884 -0.3797694 -0.1590819 0.1183316 -0.3162569 -1.1210395 0.305597 0.1912787 0.3420301 -0.5104391 -0.6893498 -0.2531415 0.1434899 -0.2376748 -0.5688167 0.3289101 -0.0663234 0.1705562 -0.7347989 -1.066157 0.054141 -0.2147412 -0.0453449 -0.5404051 0.1008675 -0.1899863 0.1249243 -0.455585 -0.4232926 0.0643147 0.0666985 0.2053028 -0.8616296 0.2110878 0.0387225 0.2066368 -0.3247986 -0.8733069 0.0407892 0.2249159 0.0152467 -0.4781933 0.0815016 0.2412364 0.0973054 -0.3296054 1.4622588 -0.4591681 -0.3344351 -0.6207422 1.2929428 -0.3269126 -0.2652556 -0.306943 0.44369 -0.0805542 -0.1710705 -0.0183118 -0.3145793 0.419044 0.018185 0.1475797 -0.0275825 -0.0303909 -0.6947367 -0.2497308 0.0134841 0.1564682 -0.4987685 0.0012013 -0.0355827 0.1092675 -0.0720121 -0.6534166 0.270644 0.0610317 0.3575899 -0.422414 0.0475632 -0.0594831 0.0210482 0.0170194 1.0586081 -0.694141 -0.0669849 -0.6488538 0.9298232 0.1417779 -0.0675331 -0.0768204 0.1239179 0.4855962 -0.0773745 -0.0239586 -0.1744683 -0.0494745 -0.0050485 -0.0443766 0.0605566 -0.0296964 -0.6320363 0.3918826 0.0467755 0.0117873 -0.0237904 -0.0389628 0.1454853 -0.1498045 -0.1327774 1.3984397 0.3689883 0.2573532 0.442894 0.743087 -0.4455252 0.4086658 -0.1896758 1.3191958 1.6434817 0.3817835 0.2097447 0.5501845 1.3210772 -0.478579 0.1345219 -0.472833 0.5309783 0.7686967 -0.3343312 -0.1662876 -0.050734 0.2326065 0.0188035 -0.2536989 0.1334392 0.3207234 0.1548256 0.0185663 -0.0046646 -0.0054948 0.0971749 -0.0015452 0.0223193 -0.0092472 0.1590464 0.0972282 -0.0147049 0.0036763 -0.008256 0.0312509 0.0094559 0.010097 0.0017074 0.1548195 -0.0209387 -0.0002104 -0.0126013 -0.1152646 0.14762 -0.0226521 -0.0195441 -0.0460431 0.042822 -0.0164836 0.082095 -0.0295008 -0.0200618 0.0317053 0.1340801 0.0647128 0.026976 -0.0737775 0.0421162 0.0320509 0.0326497 0.0916355 -0.111921 -0.0542437 0.0779646 -0.0723623 0.101591 0.2288889 -0.0688567 0.0588566 -0.0397125 0.3161074 0.0664063 0.1501997 0.0876177 0.3048944 0.1640499 -0.0033874 -0.0790283 0.0498003 0.3743292 0.0146233 -0.1289406 -0.0282475 0.36072 unknown
polarizability: 203.8223242|-10.4022866|152.0918189|-8.4442067|-15.2514497|73.1218741 unknown
InChI: InChI=1S/C9H7NO7/c1-17-7-3-4(8(11)12)6(10(15)16)2-5(7)9(13)14/h2-3,11,13H,1H3
charge 0 multiplicity 1
24 atoms
O  2.066227 -2.198987 -0.006543
O  -3.381529 -1.081022 -0.940495
O  2.792177 2.132623 -0.701215
O  -3.052042 -2.035995 1.159832
O  3.783998 0.390021 0.459922
O  -1.889878 2.799768 -0.603956
O  -3.189749 1.306726 0.536192
N  -2.097539 1.644251 -0.06799
C  -1.267975 -0.72867 0.116275
C  1.416631 0.245327 -0.180414
C  -1.005856 0.652078 -0.107978
C  1.162665 -1.158112 -0.003604
C  0.303524 1.122746 -0.261735
C  -0.179609 -1.605212 0.175064
C  -2.649327 -1.320774 0.220858
C  2.768718 0.863354 -0.107145
C  3.360707 -2.150948 -0.721829
H  0.471987 2.192988 -0.400823
H  -0.338273 -2.677661 0.315943
H  4.130609 -1.695291 -0.08296
H  3.261725 -1.579459 -1.662947
H  3.585539 -3.205788 -0.937848
H  -4.305425 -1.436875 -0.837396
H  3.686097 2.543112 -0.552708
