program: Gaussian 09
title: 000282990
version: EM64L-G09RevD.01
frameworkgroup: C1[X(C11H15NO)]
method: RPBEPBE
basis: SDD
operation: Freq
keyword: #p
keyword: freq=noraman
keyword: PBEPBE/SDD
title: #p freq=noraman PBEPBE/SDD
converged: YES YES NO NO
title: Mulliken charges:
elementType: O N C C C C C C C C C C C H H H H H H H H H H H H H H H
charge: -0.262595 -0.614409 0.138439 0.348444 -0.746400 -0.720583 -0.736158 0.133649 -0.387527 -0.380739 -0.259061 -0.249334 0.086620 0.219469 0.210557 0.217811 0.205969 0.199134 0.293150 0.208410 0.207905 0.261890 0.249398 0.255470 0.228442 0.232846 0.330007 0.329196
chargesum: 0.00000
title: Mulliken charges with hydrogens summed into heavy atoms:
elementType: O N C C C C C C C C C C C
charge: -0.262595 0.044795 0.138439 0.348444 -0.098562 -0.022330 -0.057952 0.133649 -0.138129 -0.125269 -0.030619 -0.016488 0.086620
polarizability: 1.43932994e+02 5.00810575e+00 1.43524283e+02 -4.64837910e+00 7.29162466e-01 8.72469640e+01
1716.lowfreq: -10.1826 -9.4531 -7.0145 -0.0008 -0.0002 0.0003 70.0946 79.6206 94.4004
frequency: 70.0838 79.6061 94.3861 148.9770 178.8199 203.4434 238.5358 254.4377 278.2380 297.1472 314.9858 352.4958 364.1084 370.6284 398.9468 465.5704 520.8859 529.7046 547.5909 565.0001 597.7145 602.4177 668.5058 726.2460 753.0255 770.7094 783.5095 838.5947 885.1259 920.7647 928.7037 948.3079 958.7133 992.5179 1017.0151 1033.1055 1047.7271 1053.7951 1069.3262 1128.0475 1138.0439 1181.4359 1200.5418 1217.5660 1257.5921 1282.8296 1319.2944 1361.1117 1373.1637 1378.6704 1403.7024 1423.0382 1455.7744 1463.1238 1472.8143 1477.5249 1485.8851 1497.9094 1507.3705 1575.4985 1580.9690 1601.6251 1622.5221 2970.7451 2973.5020 2983.3631 3061.4466 3065.9092 3070.0342 3075.5656 3102.9158 3112.3148 3123.7510 3134.1728 3157.6619 3175.5981 3511.9908 3671.0612
redmass: 4.3824 3.3904 3.6002 2.7027 5.2096 1.2395 1.5034 1.7779 2.8685 2.8500 1.2107 2.6467 3.1192 3.0588 2.3628 3.1583 2.4050 1.4598 2.2077 3.0978 4.4029 1.2852 4.6704 4.2470 4.0311 1.4929 3.4910 2.7367 1.4388 1.7519 1.6281 1.2432 1.3836 1.3307 1.4718 1.3997 2.8152 2.7447 2.3437 1.9721 1.8415 1.0963 2.9298 2.2745 2.6952 1.5423 4.4200 7.4222 1.2322 1.1784 1.2123 1.9981 1.0676 1.2454 1.0574 1.6654 1.0681 1.0815 1.0620 6.1393 1.9935 4.9167 2.3509 1.0356 1.0359 1.0378 1.0998 1.0994 1.0999 1.0981 1.0998 1.0963 1.0857 1.0903 1.0969 1.0949 1.0446 1.1045
irintensity: 8.6631 2.5626 0.8055 2.2988 6.9832 0.3363 0.6824 0.9796 0.0856 0.9041 0.3359 0.5578 0.9073 3.9397 1.1701 1.3990 33.3364 105.1995 38.1740 5.3534 20.2315 60.0486 4.3517 44.7232 6.2253 54.1671 6.9187 6.8515 0.4195 1.9899 3.3394 0.6133 2.0208 0.1039 0.7515 0.4107 15.6561 4.3037 12.6231 4.1088 1.2970 0.3008 4.7572 5.9956 29.3296 1.9926 154.7467 21.3549 30.8101 25.6948 16.3524 7.0803 0.5682 16.4464 2.5584 14.0705 10.4608 8.8371 22.4507 16.0501 65.1285 20.3836 265.3728 33.3130 44.4876 37.6015 12.7134 9.5227 45.7042 89.9536 0.1663 18.8712 0.7801 12.3915 27.3500 16.9377 38.7830 23.1744
temp: 298.150 k
press: 1.00000 atm
elementType: 8 7 6 6 6 6 6 6 6 6 6 6 6 1 1 1 1 1 1 1 1 1 1 1 1 1 1 1
symmnumber: 1
zpe: 618861.1 jmol-1
zpe.correction: 0.235712 hartree
zpe.thermalcorrener: 0.248835 hartree
zpe.thermalcorrenthalpy: 0.249779 hartree
zpe.thermalcorrgfe: 0.197298 hartree
zpe.sumelectzpe: -557.183806 hartree
zpe.sumelectthermal: -557.170683 hartree
zpe.sumelectthermalent: -557.169739 hartree
zpe.sumelectthermalfe: -557.222220 hartree
dipole: 1.5999 1.1381 -3.1489
dipole: 3.7109
quadrupole: -69.2620 -74.6436 -82.2731
quadrupole: -3.8701 -3.3658 8.3130
quadrupole: 6.1309 0.7493 -6.8802 -3.8701 -3.3658 8.3130
hfenergy: -557.4195175 hartree
pointgroup: C01 [X(C11H15N1O1)]
dipole: 0.7444443 0.0540504 -1.2547615 debye
polarizability: 148.6532175|0.1157536|136.1726519|-3.3652067|11.8497231|89.8783718 unknown
InChI: InChI=1S/C11H15NO/c1-11(2,3)9-7-5-4-6-8(9)10(12)13/h4-7H,12H2,1-3H3
charge 0 multiplicity 1
28 atoms
O  -1.618556 -2.024804 0.69679
N  -0.721636 -2.614976 -1.351938
C  -1.252197 1.314461 0.079339
C  0.144404 0.632601 0.016912
C  -1.150692 2.857623 -0.090973
C  -1.900567 1.035063 1.472594
C  -2.186551 0.801377 -1.057623
C  0.343949 -0.779876 -0.147162
C  1.318158 1.427579 0.125966
C  1.658541 -1.319392 -0.202547
C  2.621242 0.885544 0.086027
C  2.800053 -0.50229 -0.080564
C  -0.759623 -1.819934 -0.214327
H  -2.171272 3.280812 -0.1144
H  -0.621456 3.339192 0.751417
H  -0.64572 3.140363 -1.033773
H  -1.266031 1.440945 2.28262
H  -2.888209 1.531635 1.528199
H  -2.033304 -0.045647 1.638852
H  -3.138554 1.363351 -1.026631
H  -1.727275 0.962366 -2.050994
H  -2.438806 -0.264604 -0.952391
H  1.218956 2.509367 0.240816
H  1.780107 -2.403609 -0.310841
H  3.48812 1.549052 0.181844
H  3.802388 -0.942508 -0.110884
H  -0.078538 -2.420372 -2.117384
H  -1.393731 -3.377818 -1.437944
