program: Gaussian 09
title: 000282992
version: EM64L-G09RevD.01
frameworkgroup: C1[X(C11H13BrO2)]
method: RPBEPBE
basis: SDD
operation: Freq
keyword: #p
keyword: freq=noraman
keyword: PBEPBE/SDD
title: #p freq=noraman PBEPBE/SDD
converged: NO YES NO NO
title: Mulliken charges:
elementType: Br O O C C C C C C C C C C C H H H H H H H H H H H H H
charge: -0.004745 -0.439737 -0.244552 0.111662 0.584445 -0.747587 -0.685512 -0.685300 -0.417780 -0.361713 -0.330269 -0.362394 0.262538 0.109483 0.218949 0.225837 0.219019 0.219552 0.211660 0.233934 0.211614 0.219541 0.233864 0.264333 0.291427 0.275044 0.386688
chargesum: 0.00000
title: Mulliken charges with hydrogens summed into heavy atoms:
elementType: Br O O C C C C C C C C C C C
charge: -0.004745 -0.053049 -0.244552 0.111662 0.584445 -0.083783 -0.020366 -0.020281 -0.417780 -0.097380 -0.038842 -0.087350 0.262538 0.109483
polarizability: 1.98686113e+02 -2.57339986e+00 1.57088212e+02 -6.57773991e-03 -1.74524363e-02 7.94347504e+01
1716.lowfreq: -11.7140 -3.7490 -0.0006 -0.0005 -0.0005 6.2221 52.7705 59.8836 89.3954
frequency: 52.7676 59.8751 89.3786 127.2657 147.2751 158.7081 170.2159 211.8181 219.8462 233.3769 264.7910 294.7592 333.1709 344.3090 346.7102 400.1259 430.1670 460.0772 464.3792 523.9441 539.9759 551.0900 610.9167 636.9463 659.1511 713.7367 754.9969 784.6789 837.9413 857.9411 923.1285 927.2934 937.9451 941.7170 988.1450 1002.2321 1017.2661 1024.2172 1038.3503 1114.4213 1147.5579 1157.7156 1201.1562 1213.7514 1253.6378 1267.6652 1324.0606 1342.0732 1375.4339 1376.8327 1382.0731 1406.9734 1457.3476 1462.7789 1474.1092 1477.7879 1478.5533 1492.3943 1502.9435 1549.5938 1605.4166 1644.7142 2974.1567 2982.0917 2985.8170 3067.9584 3070.2167 3072.9959 3078.7934 3112.1158 3114.6441 3168.3502 3169.4513 3191.1862 3532.6220
redmass: 7.8712 4.0918 3.4667 9.1908 4.1796 6.2883 1.2950 1.1791 2.3671 2.8279 8.8533 3.7717 1.2267 2.2326 2.9520 2.4712 3.3686 4.1508 3.6545 4.9122 2.3357 3.5196 1.4443 4.4393 6.7980 4.7811 4.0098 5.3512 3.0514 1.4467 1.7453 1.7088 1.4627 1.1996 1.3640 4.8630 1.4350 1.3793 3.3370 2.5081 1.6332 1.6582 2.9763 2.1770 2.6299 1.4889 2.6529 3.9667 1.2183 1.1779 3.5346 1.2312 1.0498 1.4073 1.0476 1.6122 1.0783 1.0502 1.0663 7.1741 6.6646 8.7754 1.0356 1.0373 1.0379 1.1005 1.0996 1.1002 1.0983 1.0972 1.0967 1.0913 1.0900 1.0945 1.0642
irintensity: 0.5658 0.7960 0.0010 0.4436 0.5989 0.7169 0.0174 0.0883 0.0025 0.8795 0.0149 0.7738 0.1155 0.0006 1.4110 1.9086 10.8686 6.7414 1.4988 5.2661 56.4032 41.7921 85.6652 9.2217 38.3713 43.3898 14.1753 28.1754 12.3091 20.3422 2.6319 3.7813 16.1099 0.0843 0.2511 60.8587 11.7496 0.8315 190.7916 81.6302 0.4838 136.0093 4.9106 4.3223 46.8856 2.7046 145.5586 10.2114 12.7114 23.7803 56.0958 13.5891 0.3708 4.8104 0.0214 3.3841 10.1104 11.1243 23.5973 38.9107 22.5426 286.0268 20.0405 38.6376 40.8149 1.8239 2.5513 48.7942 89.2088 0.2894 22.1325 1.6225 0.1304 4.7796 51.7816
temp: 298.150 k
press: 1.00000 atm
elementType: 35 8 8 6 6 6 6 6 6 6 6 6 6 6 1 1 1 1 1 1 1 1 1 1 1 1 1
symmnumber: 1
zpe: 558117.9 jmol-1
zpe.correction: 0.212576 hartree
zpe.thermalcorrener: 0.227081 hartree
zpe.thermalcorrenthalpy: 0.228025 hartree
zpe.thermalcorrgfe: 0.170832 hartree
zpe.sumelectzpe: -589.843461 hartree
zpe.sumelectthermal: -589.828955 hartree
zpe.sumelectthermalent: -589.828011 hartree
zpe.sumelectthermalfe: -589.885204 hartree
dipole: 1.0571 3.3651 0.0004
dipole: 3.5273
quadrupole: -84.6152 -92.2937 -94.8251
quadrupole: -4.7890 0.0091 -0.0019
quadrupole: 5.9628 -1.7157 -4.2471 -4.7890 0.0091 -0.0019
hfenergy: -590.0560364 hartree
pointgroup: C01 [X(C11H13Br1O2)]
dipole: -0.5940475 -1.2540627 -0.0149997 debye
polarizability: 197.1928323|-8.150339|158.5707723|0.6813644|0.6828072|79.4454702 unknown
InChI: InChI=1S/C11H13BrO2/c1-11(2,3)8-5-4-7(10(13)14)6-9(8)12/h4-6,13H,1-3H3
charge 0 multiplicity 1
27 atoms
Br -1.240899 2.808235 0.020856
O  3.96928 -1.150821 0.016929
O  3.942643 1.172396 0.039693
C  -2.605206 -0.396372 -0.016389
C  -1.061486 -0.216841 -0.006031
C  -3.015806 -1.896519 -0.032237
C  -3.216305 0.248613 -1.299519
C  -3.230438 0.225342 1.271182
C  -0.361353 1.030126 0.010183
C  -0.220424 -1.371393 -0.011072
C  1.042949 1.117361 0.020672
C  1.184311 -1.314104 -0.001202
C  1.830979 -0.057792 0.01508
C  3.309443 0.089388 0.027165
H  -2.659225 -2.438223 0.863219
H  -4.118849 -1.958654 -0.037362
H  -2.652176 -2.421453 -0.934837
H  -2.802499 -0.227001 -2.207786
H  -4.31119 0.092597 -1.299683
H  -3.029358 1.331421 -1.362132
H  -4.325001 0.067883 1.256931
H  -2.825557 -0.265568 2.175376
H  -3.045682 1.307189 1.354513
H  -0.690273 -2.356409 -0.023174
H  1.547369 2.087733 0.033593
H  1.781339 -2.229817 -0.005911
H  4.950717 -0.989516 0.023447
