program: Gaussian 09
title: 000282970
version: EM64L-G09RevD.01
frameworkgroup: C1[X(C9H5F2N)]
method: RPBEPBE
basis: SDD
operation: Freq
keyword: #pfreq=noraman
keyword: PBEPBE/SDD
title: #p freq=noraman PBEPBE/SDD
converged: NO NO NO NO
title: Mulliken charges:
elementType: F F N C C C C C C C C C H H H H H
charge: -0.163957 -0.193374 0.023134 0.504458 -0.229845 -0.569131 0.326116 -0.297912 0.376122 -0.531529 -0.174574 -0.356721 0.264584 0.251082 0.285757 0.235862 0.249927
chargesum: 0.00000
title: Mulliken charges with hydrogens summed into heavy atoms:
elementType: F F N C C C C C C C C C
charge: -0.163957 -0.193374 0.023134 0.504458 -0.229845 -0.304547 0.326116 -0.046829 0.376122 -0.245772 0.061288 -0.106795
polarizability: 1.56512384e+02 -4.17513868e+00 1.09032448e+02 2.20612721e-03 1.46013768e-03 4.01901892e+01
1716.lowfreq: -9.1204 -0.0012 -0.0006 -0.0003 6.8013 8.5115 111.6222 153.0540 219.5720
frequency: 111.6085 153.0482 219.5703 252.6922 293.5585 305.4314 419.1601 428.4000 469.2163 511.8213 522.2398 575.5696 593.9284 626.5289 637.4288 742.1815 795.8200 804.2095 855.8041 870.8485 878.2512 942.2973 963.5931 991.9086 1029.0988 1051.7912 1109.2039 1148.1908 1197.7008 1224.6417 1286.9556 1344.6986 1369.7141 1391.6074 1426.6357 1452.6077 1491.2295 1565.9231 1595.2091 1628.3664 3129.5998 3136.4976 3159.4759 3167.6576 3182.8679
redmass: 6.4124 6.2311 5.6016 8.5473 13.2728 4.8140 11.1900 3.9050 5.8213 10.8194 3.9700 5.9406 4.4230 7.8000 2.6559 5.5729 1.4577 2.7558 1.4804 6.3458 1.7413 1.4462 5.5792 1.3798 2.6836 5.1570 1.8384 1.3511 1.4566 1.8741 4.3837 3.9212 2.1694 3.2055 3.8153 3.4256 4.7848 7.6729 6.3402 7.6388 1.0882 1.0919 1.0932 1.0994 1.0935
irintensity: 0.8147 2.2089 1.9359 1.1521 3.2786 3.1266 1.9802 0.5705 4.6775 1.3226 0.1034 1.8337 8.0570 11.8153 0.4683 8.9581 40.7985 2.4085 2.3263 3.9171 89.3516 1.8376 45.1775 1.3781 10.8255 52.4916 24.2380 10.2998 4.3883 0.8119 49.2967 13.6999 56.1856 2.0264 10.3157 22.7864 68.6200 66.3417 14.5430 85.1656 6.8284 13.8511 3.2383 21.4943 1.1407
temp: 298.150 k
press: 1.00000 atm
elementType: 9 9 7 6 6 6 6 6 6 6 6 6 1 1 1 1 1
symmnumber: 1
zpe: 305375.5 jmol-1
zpe.correction: 0.116311 hartree
zpe.thermalcorrener: 0.124986 hartree
zpe.thermalcorrenthalpy: 0.125930 hartree
zpe.thermalcorrgfe: 0.082378 hartree
zpe.sumelectzpe: -599.565027 hartree
zpe.sumelectthermal: -599.556352 hartree
zpe.sumelectthermalent: -599.555408 hartree
zpe.sumelectthermalfe: -599.598960 hartree
dipole: 1.5286 -3.3702 0.0000
dipole: 3.7007
quadrupole: -62.3287 -68.1450 -69.4921
quadrupole: -8.5872 -0.0001 -0.0002
quadrupole: 4.3266 -1.4897 -2.8369 -8.5872 -0.0001 -0.0002
hfenergy: -599.6813385 hartree
pointgroup: C01 [X(C9H5F2N1)]
dipole: -0.6082845 1.3228134 -0.0000133 debye
dipolederiv: -0.1894279 -0.0261382 0.0000019 0.0573601 -1.0424031 0.0000221 -0.0000008 0.0000263 -0.1218272 -1.1301101 -0.2291974 0.0000299 -0.372294 -0.3034998 0.0000134 0.000026 0.0000089 -0.146256 -0.292928 -0.040601 0.000002 0.0791677 -0.2951548 -0.0000001 -0.0000014 0.0000012 -0.2158559 0.1920487 0.0288738 -0.0000054 0.2043921 -0.1361841 -0.0000007 -0.0000111 0.0000034 0.101654 0.124703 0.2038375 -0.0000053 -0.2056844 -0.1417808 0.000009 0.0000064 0.0000017 0.0040737 -0.4063634 -0.0316386 0.0000043 0.1322886 -0.0473278 -0.0000069 0.0000017 -0.0000026 -0.2042287 0.3620494 -0.0196331 -0.0000044 -0.0465926 1.2703096 -0.0000283 -0.0000046 -0.0000316 0.1188115 0.0652863 0.0068972 -0.0000031 -0.0359433 0.1920698 -0.0000046 -0.0000042 -0.0000064 -0.1420008 1.2963902 0.2848104 -0.000036 0.3389564 0.5420799 -0.0000199 -0.0000298 -0.00002 0.1101987 -0.2737653 -0.1810282 0.000007 -0.1619362 -0.2750764 0.0000054 0.0000057 0.0000072 -0.1862208 -0.0788192 -0.1265985 0.0000018 -0.2372308 -0.0867453 0.000004 0.0000024 0.0000022 -0.0979865 0.2628336 0.0904276 -0.0000061 0.2231735 0.2468025 -0.0000091 -0.0000068 -0.0000066 -0.0593536 0.0791782 0.0137771 0.0000029 -0.0449211 -0.0284019 0.0000061 0.0000052 0.0000052 0.1920295 0.0833955 -0.0537332 0.000002 0.0071762 -0.0734884 0.0000035 0.0000016 0.0000061 0.1468605 0.0579992 0.0464506 0.0000017 0.0359939 0.0778807 0.0000032 0.000003 0.0000032 0.2063808 -0.0495424 0.090633 0.0000021 0.0971791 0.0423131 0.0000004 0.0000033 -0.0000003 0.1641928 -0.1029277 -0.057139 0.0000046 -0.0710853 0.0586071 0.0000025 0.0000035 0.0000024 0.129528 unknown
polarizability: 156.5544247|-3.9286067|108.9904082|-0.0021985|-0.0014716|40.1901892 unknown
InChI: InChI=1S/C9H5F2N/c10-7-4-6-2-1-3-12-9(6)8(11)5-7/h1-5H
charge 0 multiplicity 1
17 atoms
F  0.548697 -2.738168 0.000072
F  3.386476 1.133945 -0.000093
N  -1.741987 -1.150737 0.000067
C  -0.316712 0.899425 0.000003
C  -0.498574 -0.539636 0.000034
C  0.997032 1.466862 -0.000045
C  0.685612 -1.355712 0.000032
C  -1.505716 1.704177 0.000014
C  2.088626 0.606786 -0.000053
C  1.965042 -0.80987 -0.000003
C  -2.755952 1.084374 0.000041
C  -2.822893 -0.349248 0.000071
H  1.144238 2.551721 -0.000074
H  -1.413324 2.796455 -0.000006
H  2.854392 -1.446582 0.0000
H  -3.682275 1.667545 0.000046
H  -3.797182 -0.851639 0.000094
