program: Gaussian 09
title: 000282987
version: EM64L-G09RevD.01
frameworkgroup: C1[X(C13H18O)]
method: RPBEPBE
basis: SDD
operation: Freq
keyword: #pfreq=noraman
keyword: PBEPBE/SDD
title: #p freq=noraman PBEPBE/SDD
converged: YES YES NO NO
title: Mulliken charges:
elementType: O C C C C C C C C C C C C C H H H H H H H H H H H H H H H H H H
charge: -0.438848 0.283742 -0.267823 -0.469323 -0.454370 -0.398379 -0.405665 0.527763 -0.761730 -0.435300 -0.358169 -0.234251 -0.262823 -0.244784 0.191026 0.180490 0.223608 0.193547 0.217628 0.201025 0.207930 0.207543 0.189873 0.260885 0.231596 0.199548 0.314184 0.217074 0.214937 0.221699 0.221534 0.225830
chargesum: 0.00000
title: Mulliken charges with hydrogens summed into heavy atoms:
elementType: O C C C C C C C C C C C C C
charge: -0.124663 0.283742 -0.076796 -0.065225 -0.043194 0.010576 -0.008249 0.527763 -0.069701 -0.218225 -0.143233 -0.012551 -0.041289 -0.018954
polarizability: 1.75623707e+02 4.65657163e+00 1.15302301e+02 3.02900331e+00 -1.59925267e+01 1.17302586e+02
1716.lowfreq: -17.0941 -13.0617 -0.0007 -0.0007 -0.0004 11.4134 32.9735 75.8525 86.6658
frequency: 32.2076 75.6890 86.6167 157.7201 181.1140 216.2393 234.7822 252.4035 285.2787 300.9419 315.9023 355.0883 395.8977 403.9932 430.9590 455.2731 474.6738 532.2366 534.2997 617.2924 625.2401 696.6515 703.1243 771.2425 781.5479 821.2368 848.3992 853.1033 877.9249 885.2244 917.6367 934.5442 966.6031 971.7195 977.3965 987.8292 991.0000 993.2291 1029.4962 1049.1184 1072.3101 1099.4153 1107.5790 1116.8966 1136.4644 1158.9920 1170.9695 1189.6749 1206.3118 1209.7406 1229.5607 1253.1004 1276.8759 1296.7814 1318.9932 1326.4136 1335.7897 1344.5235 1351.3273 1364.7827 1382.7684 1395.5523 1438.0895 1455.4631 1457.1513 1467.2053 1473.4184 1474.5443 1482.3250 1484.0562 1590.6704 1613.3820 2927.2283 2945.0740 2965.5107 2978.3780 2981.2216 2998.5627 3029.5798 3033.6573 3038.5401 3046.1913 3092.3769 3106.0900 3114.5692 3121.2151 3135.2185 3145.5802 3161.3577 3533.1528
redmass: 3.7690 2.8157 4.3610 2.0729 1.2952 2.3955 4.9341 2.8991 1.4376 1.9310 2.3208 2.2683 2.9881 2.7951 3.1288 3.0431 3.0218 3.0067 2.1341 6.3000 4.2068 3.3407 1.5555 1.9070 2.3082 1.9358 1.2677 2.4441 2.2724 1.6465 1.5191 2.0332 2.1411 1.4014 1.7583 1.7272 2.8900 1.9135 2.1200 1.7753 1.4953 1.8534 1.7107 1.7406 1.5691 1.8871 1.0535 1.1171 1.5509 2.2433 1.4784 1.4125 1.5513 1.3330 1.4454 1.4080 1.3956 1.4507 1.4386 1.4693 4.6810 1.4802 2.1401 1.0886 1.0681 1.0826 1.0760 1.0898 1.2248 1.7660 5.9488 6.1795 1.0812 1.0671 1.0633 1.0623 1.0611 1.0362 1.0958 1.0967 1.0993 1.1031 1.0992 1.0994 1.0859 1.0862 1.0915 1.0953 1.1014 1.0656
irintensity: 0.7986 0.4656 0.7599 0.3478 6.9213 2.4939 0.0593 6.7053 61.4929 84.0876 6.9222 1.0000 10.7523 0.2588 2.6071 4.3705 3.1197 12.8562 4.6677 0.1618 2.5950 3.8234 56.7329 34.4084 3.1143 1.5933 1.5133 8.5427 26.3988 3.6150 1.9193 0.6198 4.6851 1.3357 13.6138 8.1090 0.9988 1.4652 6.7807 1.9472 3.3522 8.3130 7.3618 52.2227 6.1704 15.3531 0.1207 0.5336 17.5137 0.1004 14.9410 7.2393 8.7448 5.3576 2.0983 3.4189 0.8184 0.7222 0.3158 17.7770 1.6214 23.8254 9.0514 5.4656 13.7821 14.3544 1.2646 5.0073 12.2119 19.4925 1.6493 7.8538 15.5659 47.3582 36.9501 27.7151 29.0710 14.7285 64.3774 61.3065 1.8842 89.4200 28.3935 21.5071 10.7105 0.1498 23.9701 50.3846 20.1092 4.7192
temp: 298.150 k
press: 1.00000 atm
elementType: 8 6 6 6 6 6 6 6 6 6 6 6 6 6 1 1 1 1 1 1 1 1 1 1 1 1 1 1 1 1 1 1
symmnumber: 1
zpe: 727661.5 jmol-1
zpe.correction: 0.277152 hartree
zpe.thermalcorrener: 0.290363 hartree
zpe.thermalcorrenthalpy: 0.291307 hartree
zpe.thermalcorrgfe: 0.237810 hartree
zpe.sumelectzpe: -580.342870 hartree
zpe.sumelectthermal: -580.329659 hartree
zpe.sumelectthermalent: -580.328714 hartree
zpe.sumelectthermalfe: -580.382211 hartree
dipole: -1.3459 -1.2758 -1.0447
dipole: 2.1285
quadrupole: -79.3488 -89.4403 -81.0821
quadrupole: 0.7185 1.4469 -7.3058
quadrupole: 3.9416 -6.1499 2.2083 0.7185 1.4469 -7.3058
hfenergy: -580.6200216 hartree
pointgroup: C01 [X(C13H18O1)]
dipole: -0.5209941 0.5087204 0.4135713 debye
polarizability: 175.4568523|-5.5670434|115.5141023|-3.4402309|-15.9345447|117.257639 unknown
InChI: InChI=1S/C13H18O/c1-13(14)10-6-5-9-12(13)11-7-3-2-4-8-11/h2-4,7-8,12,14H,5-6,9-10H2,1H3
charge 0 multiplicity 1
32 atoms
O  -0.834015 -2.252755 0.042555
C  -1.352694 -0.898676 -0.29274
C  -0.564661 0.19029 0.534308
C  -2.856648 -0.843984 0.093794
C  -1.202902 1.59836 0.35506
C  -3.488421 0.556536 -0.07622
C  -2.700734 1.610917 0.733629
C  0.942645 0.178986 0.277941
C  -1.136429 -0.804414 -1.810791
C  1.794067 -0.611587 1.09261
C  1.53934 0.935874 -0.765359
C  3.188942 -0.654274 0.87479
C  2.933717 0.898891 -0.989058
C  3.766409 0.101884 -0.170878
H  -0.718138 -0.09338 1.600889
H  -2.953316 -1.145043 1.160459
H  -3.397634 -1.601893 -0.503529
H  -1.097051 1.932873 -0.695793
H  -0.64338 2.32609 0.97336
H  -4.545923 0.531145 0.25032
H  -3.495613 0.839075 -1.147882
H  -3.124503 2.620343 0.568813
H  -2.807162 1.391754 1.816773
H  -0.073717 -0.967387 -2.052284
H  -1.727569 -1.589258 -2.31382
H  -1.443955 0.176663 -2.211982
H  -0.984218 -2.412614 1.010461
H  1.358483 -1.201112 1.908587
H  0.91438 1.563667 -1.410333
H  3.823261 -1.275416 1.517676
H  3.369784 1.492941 -1.800613
H  4.848351 0.073204 -0.342844
