program: Gaussian 09
title: 000283009
version: EM64L-G09RevD.01
frameworkgroup: C1[X(C13H14N2O6)]
method: RPBEPBE
basis: SDD
operation: Freq
keyword: #p
keyword: freq=noraman
keyword: PBEPBE/SDD
title: #p freq=noraman PBEPBE/SDD
converged: YES YES NO NO
title: Mulliken charges:
elementType: O O O O O O N N C C C C C C C C C C C C C H H H H H H H H H H H H H H
charge: -0.239276 -0.196939 -0.255695 -0.284723 -0.200838 -0.262763 -0.455245 0.021662 0.331987 0.208135 0.496781 -0.555530 -0.324067 -0.368621 0.394166 -0.801010 -0.452857 0.089298 0.232267 -0.498713 -0.503533 0.291921 0.275698 0.243181 0.365284 0.236740 0.236142 0.235179 0.284927 0.234155 0.261068 0.245828 0.240717 0.232302 0.242372
chargesum: 0.00000
title: Mulliken charges with hydrogens summed into heavy atoms:
elementType: O O O O O O N N C C C C C C C C C C C C C
charge: -0.239276 -0.196939 -0.255695 -0.284723 -0.200838 -0.262763 -0.089961 0.021662 0.331987 0.208135 0.496781 -0.263609 -0.048369 -0.125439 0.394166 -0.092950 -0.167930 0.089298 0.232267 0.242337 0.211859
polarizability: 3.25057831e+02 -1.53836245e+01 2.20768536e+02 -3.68352417e+00 7.12528272e+00 1.06157171e+02
1716.lowfreq: -7.4055 -5.8836 -3.8921 -0.0005 -0.0003 0.0004 22.1557 24.3617 36.4703
frequency: 22.0433 24.2569 36.4459 42.1535 48.7590 71.2161 75.7608 83.1955 101.1727 112.3515 119.1768 133.7641 166.5860 174.5749 184.9220 197.9496 237.4605 247.0297 258.0082 275.8787 308.0547 323.0704 357.6183 372.9690 399.6138 427.6968 462.7913 474.6145 530.8141 556.7218 635.7078 642.6730 661.9186 668.3892 682.1716 701.3113 716.1166 730.2944 746.2621 794.1220 813.4135 829.1681 830.6737 866.8224 890.5338 907.9006 917.0273 935.7562 982.1386 1000.9679 1011.2548 1051.3296 1063.5519 1109.4730 1112.1981 1115.5951 1131.5960 1148.9499 1155.4357 1160.2586 1172.7108 1222.2578 1241.8369 1270.7484 1315.1026 1338.4280 1352.7846 1376.8833 1402.1355 1419.4450 1424.7728 1425.1559 1450.5812 1452.8672 1463.6159 1463.9121 1469.2224 1469.4535 1503.0078 1526.9429 1586.4785 1605.6305 1620.8664 1632.2199 1634.5095 2981.8214 3001.3338 3008.9515 3059.3505 3095.5040 3101.0218 3116.5311 3135.2973 3145.8849 3156.6773 3171.9495 3180.8367 3191.4630 3220.4278
redmass: 5.8039 5.5963 3.3126 1.2300 4.3173 2.9023 6.7806 1.3801 3.3426 1.3614 2.8819 4.6505 4.7195 6.0431 6.6581 4.8294 3.9930 5.6215 5.0403 5.0965 4.4645 6.0540 4.8567 4.8083 9.5884 3.9983 6.4369 5.5389 3.2193 5.4178 6.7836 5.6082 7.1842 5.7575 5.7233 5.9124 5.2487 6.3571 8.5376 5.2362 1.3695 2.7392 1.8856 1.4261 5.8724 3.4998 1.5224 7.7132 1.3577 1.6455 3.4710 1.5420 3.1436 1.9680 1.3081 1.8777 2.4747 1.4439 1.5190 1.8138 4.0241 1.8264 4.6175 2.2008 2.8614 2.3436 2.8267 3.9592 1.2269 1.2285 1.4509 3.0060 1.0502 1.0497 1.0513 1.0533 1.0454 1.1696 3.1373 2.6976 3.9620 6.4909 4.0468 7.8307 7.1331 1.0379 1.0297 1.0289 1.0976 1.0986 1.1042 1.1052 1.0907 1.1044 1.1052 1.0918 1.0927 1.0925 1.0791
irintensity: 1.8935 1.6251 0.7689 0.1435 0.7596 1.7341 1.9576 0.0312 1.5142 0.9063 0.9162 4.5127 0.6011 0.3381 2.5959 4.9930 13.4687 5.4025 2.4518 4.2102 10.9882 26.7261 5.6821 1.4842 0.3343 1.2164 10.3822 0.8809 23.3341 8.0243 18.1670 10.0513 2.4150 1.9532 7.1084 10.7439 0.8654 3.2205 1.0682 8.2329 58.5996 56.5305 93.7207 7.2399 12.7971 5.8457 8.2817 24.0614 3.6093 28.1395 54.0401 12.4952 10.7805 247.7884 30.3125 320.3885 158.3262 12.8872 25.6133 116.0901 262.5569 44.2767 108.7023 118.2553 93.6579 217.5675 52.8346 137.2641 8.0602 20.4811 22.7032 16.1571 13.1545 13.7362 19.5871 5.8067 15.2089 11.6562 294.3617 172.8653 788.9146 140.4359 176.6068 49.6627 59.0650 32.1633 48.6093 29.7292 16.2239 12.2567 26.9046 12.3648 10.6852 19.4712 13.4676 2.6420 7.2513 2.2459 145.6335
temp: 298.150 k
press: 1.00000 atm
elementType: 8 8 8 8 8 8 7 7 6 6 6 6 6 6 6 6 6 6 6 6 6 1 1 1 1 1 1 1 1 1 1 1 1 1 1
symmnumber: 1
zpe: 677375.3 jmol-1
zpe.correction: 0.257999 hartree
zpe.thermalcorrener: 0.279720 hartree
zpe.thermalcorrenthalpy: 0.280664 hartree
zpe.thermalcorrgfe: 0.203949 hartree
zpe.sumelectzpe: -1062.992467 hartree
zpe.sumelectthermal: -1062.970746 hartree
zpe.sumelectthermalent: -1062.969802 hartree
zpe.sumelectthermalfe: -1063.046517 hartree
dipole: 0.3697 5.2949 -0.8097
dipole: 5.3692
quadrupole: -104.5672 -114.8091 -129.8584
quadrupole: 15.9702 11.4954 1.8364
quadrupole: 11.8444 1.6025 -13.4468 15.9702 11.4954 1.8364
hfenergy: -1063.250466 hartree
pointgroup: C01 [X(C13H14N2O6)]
dipole: -0.192981 2.0231131 0.5762494 debye
polarizability: 324.4612855|16.7031606|221.0991141|6.7086486|8.3319066|106.4231387 unknown
InChI: InChI=1S/C13H14N2O6/c1-8-4-5-9(11(6-8)15(18)19)14-10(13(17)21-3)7-12(16)20-2/h4-7,14H,1-3H3
charge 0 multiplicity 1
35 atoms
O  2.816675 -1.972313 0.282831
O  -3.884895 -2.570691 0.434761
O  -1.695619 -2.833438 -0.125269
O  3.222142 2.405783 1.120044
O  2.236083 -1.619606 -1.954221
O  3.983325 0.642488 -0.216515
N  -0.161024 -0.728294 -0.304587
N  -2.746568 -2.073737 0.091819
C  -1.343798 0.019386 -0.26172
C  -2.618387 -0.623784 -0.072466
C  -3.830797 1.513418 -0.210334
C  -3.826457 0.120616 -0.039601
C  -1.371438 1.433015 -0.456582
C  -2.574113 2.149471 -0.437299
C  1.16292 -0.312945 -0.179215
C  -5.116068 2.316534 -0.178199
C  1.614004 0.867179 0.369627
C  2.136751 -1.340051 -0.739713
C  3.033908 1.232054 0.367301
C  3.905859 -2.886963 -0.143488
C  4.619283 2.88714 1.194996
H  -4.755974 -0.433102 0.118802
H  -0.43965 1.957336 -0.675441
H  -2.546211 3.231282 -0.614223
H  -0.349203 -1.747312 -0.395173
H  -5.096816 3.06933 0.631898
H  -5.270204 2.863914 -1.126846
H  -5.994005 1.669824 -0.015435
H  0.937076 1.571748 0.855856
H  4.247971 -3.365932 0.783746
H  4.707113 -2.287035 -0.605495
H  3.525689 -3.629156 -0.864879
H  5.256524 2.137803 1.694703
H  4.566476 3.814857 1.781947
H  5.015634 3.076883 0.182968
