program: Gaussian 09
title: 000282971
version: EM64L-G09RevD.01
frameworkgroup: C1[X(C10H6Br3N)]
method: RPBEPBE
basis: SDD
operation: Freq
keyword: #p
keyword: freq=noraman
keyword: PBEPBE/SDD
title: #p freq=noraman PBEPBE/SDD
converged: NO YES NO NO
title: Mulliken charges:
elementType: Br Br Br N C C C C C C C C C C H H H H H H
charge: 0.035405 0.057856 0.039101 -0.007410 0.494368 0.041583 -0.246747 0.146005 -0.302580 -0.336401 -0.259395 -0.258156 -0.161588 -0.780159 0.270294 0.257693 0.276586 0.263883 0.234819 0.234841
chargesum: 0.00000
title: Mulliken charges with hydrogens summed into heavy atoms:
elementType: Br Br Br N C C C C C C C C C C
charge: 0.035405 0.057856 0.039101 -0.007410 0.494368 0.041583 -0.246747 0.146005 -0.032286 -0.336401 -0.001702 -0.258156 0.114998 -0.046615
polarizability: 2.24411277e+02 -1.02782227e+01 2.40199980e+02 5.38923320e-03 8.46161167e-03 5.93393885e+01
1716.lowfreq: -4.4681 -3.7370 -2.8662 0.0002 0.0002 0.0004 34.3986 81.3518 91.7725
frequency: 34.3978 81.3494 91.7723 92.2606 118.5887 146.5170 171.5396 180.6038 190.8639 208.6819 255.0621 320.7774 361.5379 364.1677 456.8785 508.4618 520.2687 547.0170 552.4678 587.7477 648.0518 698.8834 754.5460 792.8145 808.6018 879.9974 884.8827 896.0981 898.2009 974.7692 1010.7785 1045.9504 1088.9848 1145.4036 1205.1972 1248.8010 1281.5736 1325.7639 1344.1396 1370.6342 1391.5634 1423.9055 1444.2854 1462.6018 1466.9660 1519.3066 1577.7791 1589.7877 2985.1208 3062.5214 3124.2134 3169.7965 3176.4083 3179.5152
redmass: 8.3495 1.1611 52.0194 4.3664 17.7725 4.8528 13.3796 3.8706 5.7910 6.3710 10.2497 9.8618 4.3853 6.3303 4.7709 5.5287 6.4039 5.8213 3.8552 5.9603 3.6430 10.6568 7.3372 4.8817 6.5033 1.5081 1.3564 1.4283 6.6438 2.9068 2.1267 1.5741 2.0768 2.6481 1.5074 3.8021 2.5034 3.7055 3.5317 6.3035 1.2414 3.0135 3.5413 1.3890 1.0460 7.0665 7.4655 8.3793 1.0385 1.0972 1.0982 1.0937 1.0921 1.0936
irintensity: 0.1807 1.0409 0.0537 0.2039 0.2392 0.1206 0.1233 0.0174 5.3053 2.3707 1.6517 5.1829 1.3762 0.1345 0.4499 2.8001 2.3663 6.3408 4.0942 0.6192 15.5924 121.7727 32.5992 4.7208 2.0340 9.2414 26.0047 14.6169 17.5615 21.4014 4.2200 6.5662 18.1586 53.4619 6.1580 43.6715 24.4752 13.4248 22.8283 82.7288 28.7250 81.3382 60.5772 60.2884 17.8880 29.2226 154.0351 2.7436 14.3685 14.5010 6.1892 1.5239 1.8945 0.3795
temp: 298.150 k
press: 1.00000 atm
elementType: 35 35 35 7 6 6 6 6 6 6 6 6 6 6 1 1 1 1 1 1
symmnumber: 1
zpe: 338954.7 jmol-1
zpe.correction: 0.129101 hartree
zpe.thermalcorrener: 0.142533 hartree
zpe.thermalcorrenthalpy: 0.143477 hartree
zpe.thermalcorrgfe: 0.085674 hartree
zpe.sumelectzpe: -478.824693 hartree
zpe.sumelectthermal: -478.811262 hartree
zpe.sumelectthermalent: -478.810318 hartree
zpe.sumelectthermalfe: -478.868120 hartree
dipole: -2.2859 0.6232 0.0000
dipole: 2.3693
quadrupole: -100.8392 -105.9393 -111.6999
quadrupole: -8.3142 0.0002 0.0001
quadrupole: 5.3203 0.2202 -5.5405 -8.3142 0.0002 0.0001
hfenergy: -478.9537943 hartree
pointgroup: C01 [X(C10H6Br3N1)]
dipole: -0.806233 0.4678796 -0.000004 debye
dipolederiv: -0.0471847 -0.0374734 -0.0000486 0.0617592 -0.7894398 -0.0000547 -0.0000637 0.0000314 -0.014754 0.0062966 -0.062851 -0.0001051 -0.0267514 -0.721095 -0.0000602 0.0000255 -0.0000665 0.0031177 -0.7367445 -0.1749651 0.0000319 -0.275531 -0.1240406 -0.0000044 -0.0003277 0.0000852 -0.0128433 -0.6186616 -0.0736708 0.0002113 0.1265011 -0.3852491 0.0000182 0.000002 0.0000151 -0.2196064 0.0064369 0.0736155 -0.0000264 0.3156958 -0.5554129 -0.0000021 -0.0002615 0.0001238 0.1015621 0.2672446 0.1342834 -0.000026 -0.1063808 -0.1890006 -0.0001221 0.0001253 -0.0000863 0.100585 0.2505949 0.0709484 0.0000977 -0.2206759 1.4537301 0.0001332 0.0001981 -0.0000886 -0.121305 0.7853429 0.0586931 -0.0001267 0.372389 0.5210297 0.0000444 0.0000548 0.0000346 0.0427096 -0.4723664 -0.0914325 0.000046 -0.0499234 -0.1005319 0.0000011 -0.000076 0.0000244 -0.0968692 0.0572334 0.1440796 0.0000499 -0.0589636 1.3489222 0.0001651 0.0001171 0.0000349 -0.1387685 -0.3280122 -0.2288993 0.000046 -0.3784318 -0.5718612 -0.0000896 -0.0000453 0.0000137 -0.0683244 1.3218011 0.3865742 -0.0000731 0.5267003 0.291825 0.0000227 0.0002926 -0.0000315 -0.1246451 -0.4085685 -0.3069096 0.0000678 -0.2392347 -0.3750864 -0.0000851 -0.0001031 0.0000247 -0.0285915 -0.3549046 -0.0688085 0.0000023 -0.0457308 -0.039346 -0.0000297 0.0000515 -0.0001497 0.0419548 0.1110335 -0.0012643 -0.0000221 -0.0593948 0.024506 -0.000014 0.0000598 -0.0000291 0.1631178 0.0040444 0.0717557 -0.0000571 0.0745314 0.0716234 0.0000232 -0.0000174 0.0000031 0.1544092 0.0464008 0.0571126 -0.0000512 0.046956 0.0635663 0.0000479 0.0000853 -0.0000524 0.1569098 0.1022606 0.0508137 -0.0000332 -0.0474669 -0.0769069 0.0001016 0.0000375 0.0000666 0.1219341 0.0038676 -0.0007793 0.0708873 -0.0079674 0.0763375 -0.0800123 0.1182355 -0.0421532 -0.0302041 0.0038853 -0.0008223 -0.0708708 -0.0080804 0.0764302 0.079917 -0.1183903 0.0421999 -0.0303887 unknown
polarizability: 242.6870635|7.7581223|221.9241938|0.002237|0.0097795|59.3393885 unknown
InChI: InChI=1S/C10H6Br3N/c1-5-2-8(12)7-3-6(11)4-9(13)10(7)14-5/h2-4H,1H3
charge 0 multiplicity 1
20 atoms
Br -0.938648 3.527778 0.000018
Br 0.764632 -3.476264 -0.000135
Br 4.328508 1.05938 0.00015
N  -1.409589 -1.244565 0.000048
C  0.09352 0.750896 0.000047
C  -0.146956 -0.686718 0.000018
C  -1.087601 1.572363 0.000051
C  -2.482647 -0.430098 0.000094
C  1.426621 1.264642 0.000086
C  1.007935 -1.546532 -0.000027
C  -2.355091 1.005628 0.000083
C  2.496156 0.37428 0.00007
C  2.308119 -1.038259 -0.000001
C  -3.856345 -1.06266 0.000114
H  1.590503 2.344831 0.00012
H  -3.25516 1.625876 0.000097
H  3.169939 -1.70978 -0.000039
H  -3.757849 -2.158387 0.000573
H  -4.436747 -0.755574 0.890293
H  -4.4364 -0.756337 -0.89056
