program: Gaussian 09
title: 000282988
version: EM64L-G09RevD.01
frameworkgroup: C1[X(C15H23NO2)]
method: RPBEPBE
basis: SDD
operation: Freq
keyword: #p
keyword: freq=noraman
keyword: PBEPBE/SDD
title: #p freq=noraman PBEPBE/SDD
converged: YES YES NO NO
title: Mulliken charges:
elementType: O O N C C C C C C C C C C C C C C C H H H H H H H H H H H H H H H H H H H H H H H
charge: -0.323368 -0.277279 -0.460029 0.336255 -0.410019 -0.392915 -0.351229 -0.726140 -0.750225 -0.349851 -0.702756 0.264406 0.479877 -0.444225 -0.355574 -0.195663 -0.210403 -0.257588 0.188626 0.198799 0.233047 0.194555 0.247669 0.213228 0.210355 0.204437 0.229039 0.208494 0.223901 0.219744 0.199632 0.186733 0.218361 0.206015 0.213355 0.328442 0.222043 0.298628 0.226403 0.226312 0.228909
chargesum: 0.00000
title: Mulliken charges with hydrogens summed into heavy atoms:
elementType: O O N C C C C C C C C C C C C C C C
charge: -0.323368 -0.277279 -0.131587 0.336255 -0.022593 0.034687 0.109667 -0.082309 -0.098085 0.036514 -0.065025 0.264406 0.479877 -0.222182 -0.056946 0.030739 0.015909 -0.028679
polarizability: 2.37690371e+02 -2.13589186e+01 1.69698949e+02 -1.81496153e+01 -1.96926608e+01 1.31245872e+02
1716.lowfreq: -12.7541 -6.7400 -0.0008 -0.0003 0.0002 6.2939 17.5038 19.5630 35.2484
frequency: 16.8069 19.3779 34.9972 54.0146 64.5997 79.3642 90.6888 122.0742 129.2462 152.8556 195.8099 212.9998 225.2123 234.0370 251.8268 254.9359 259.7813 300.0427 303.4762 331.2310 349.7296 394.9852 408.5628 451.8162 477.7652 500.3216 509.5488 605.0990 618.6318 644.8643 678.7544 694.0064 698.2740 733.4874 758.7826 765.9425 783.4464 827.1847 841.5551 884.0844 894.7984 904.1653 907.8451 913.3366 923.5251 936.6612 971.6588 974.4840 984.5144 995.8733 1004.9333 1011.0089 1031.2345 1037.6384 1078.1401 1083.3195 1090.0905 1100.4281 1158.5977 1172.6866 1181.9776 1189.4876 1199.9939 1217.1982 1245.7847 1259.4394 1274.9124 1287.0806 1293.8271 1308.5684 1324.8762 1335.1565 1352.7809 1358.9891 1374.6528 1386.2817 1386.9849 1393.6099 1433.8681 1455.1292 1459.7235 1466.2025 1469.2388 1471.4965 1476.4183 1477.9433 1479.7572 1485.7273 1487.6684 1492.2179 1517.9675 1600.9949 1617.8334 1662.3539 2955.1091 2960.3356 2970.4121 2971.3932 2972.9603 2974.9852 3001.1062 3007.7297 3010.9994 3043.4304 3061.9228 3066.3224 3068.2392 3071.0054 3075.4095 3081.9423 3083.0686 3112.9216 3132.3889 3144.3875 3165.3284 3189.4665 3540.7667
redmass: 3.6977 4.4093 3.0824 2.1176 4.8387 4.4517 3.8321 2.9586 2.8075 2.5582 1.0708 2.3307 1.9417 1.5931 1.6448 2.6011 3.3667 2.7787 3.0083 2.8917 3.4963 2.9006 2.9269 2.3574 2.5283 3.6585 2.8561 5.8131 6.1029 1.3654 6.2736 3.1046 2.5395 1.0929 3.1409 1.6716 1.2886 5.1897 1.2650 3.4150 1.8691 1.9543 1.6605 1.4298 2.0080 1.4229 1.3536 1.6117 5.7499 1.3032 1.9845 2.2444 2.2120 2.8978 2.4260 1.4451 1.5527 2.1448 3.3509 1.0503 2.3587 1.1139 1.8435 1.8900 1.5369 2.0941 1.4904 1.4118 1.2466 1.1625 1.4003 1.4815 1.3460 1.4957 1.2072 3.7208 1.3908 1.2399 2.3492 1.0687 1.0812 1.0699 1.0528 1.0617 1.0467 1.0674 1.0583 2.2077 1.0798 1.0699 2.2451 5.2889 6.0322 8.0975 1.0593 1.0583 1.0402 1.0362 1.0510 1.0419 1.0948 1.0983 1.0606 1.1038 1.0994 1.0993 1.0998 1.1000 1.0995 1.1007 1.1050 1.0884 1.0869 1.0935 1.0996 1.0953 1.0759
irintensity: 0.7677 0.0946 0.6598 0.3876 1.3603 3.1322 0.4627 0.5357 1.4919 0.5573 0.1446 0.6596 0.3210 0.2542 1.0315 3.6296 10.7761 2.3793 2.4466 1.0060 7.3408 3.5755 0.0079 3.8135 1.7999 4.0016 25.7170 0.4530 2.0108 23.6339 12.7110 2.7568 85.8772 16.1304 0.4842 106.3955 2.1396 6.7812 0.4831 14.4645 8.2061 6.8117 3.3097 14.4243 4.1266 3.3260 0.0664 26.0268 3.5103 2.4665 116.1176 167.1731 34.6787 2.4472 0.7155 7.2022 31.6046 6.7772 412.1216 0.4689 8.8065 6.5180 5.2069 1.5679 2.2114 5.3033 1.4015 12.8890 1.3878 4.0739 46.0254 5.5804 2.5344 0.8016 23.2810 57.5978 19.2140 14.4143 115.6442 2.3061 9.0474 0.6971 3.9419 10.5856 9.5073 6.6861 6.7571 11.7888 12.2616 35.0413 531.8251 33.6642 107.8001 217.9714 10.9948 26.4479 13.2497 25.3547 72.6059 48.3164 20.1576 1.7294 51.8480 42.2204 7.1135 58.9127 69.7467 72.3663 35.1096 38.7061 31.8010 13.8178 0.6001 30.8256 23.8684 5.8937 27.7354
temp: 298.150 k
press: 1.00000 atm
elementType: 8 8 7 6 6 6 6 6 6 6 6 6 6 6 6 6 6 6 1 1 1 1 1 1 1 1 1 1 1 1 1 1 1 1 1 1 1 1 1 1 1
symmnumber: 1
zpe: 922458.0 jmol-1
zpe.correction: 0.351346 hartree
zpe.thermalcorrener: 0.371127 hartree
zpe.thermalcorrenthalpy: 0.372071 hartree
zpe.thermalcorrgfe: 0.300726 hartree
zpe.sumelectzpe: -789.225517 hartree
zpe.sumelectthermal: -789.205736 hartree
zpe.sumelectthermalent: -789.204792 hartree
zpe.sumelectthermalfe: -789.276137 hartree
dipole: 0.3695 -1.7353 1.3659
dipole: 2.2391
quadrupole: -98.4121 -106.9654 -112.3564
quadrupole: -1.2774 -4.4448 -2.4711
quadrupole: 7.4992 -1.0541 -6.4451 -1.2774 -4.4448 -2.4711
hfenergy: -789.5768631 hartree
pointgroup: C01 [X(C15H23N1O2)]
dipole: -0.0938125 0.4894261 0.7264457 debye
polarizability: 227.6813171|-37.6482681|162.9429941|16.2076486|24.5984554|148.0108798 unknown
InChI: InChI=1S/C15H23NO2/c1-4-5-11-15(2,3)12-18-14(17)16-13-9-7-6-8-10-13/h6-10,16H,4-5,11-12H2,1-3H3
charge 0 multiplicity 1
41 atoms
O  -0.654731 1.74741 0.20816
O  0.012871 0.133762 -1.387808
N  1.366228 0.787124 0.447458
C  -3.140879 1.502736 0.412841
C  -3.081517 -0.026711 0.718898
C  -3.215511 -0.99235 -0.481724
C  -1.957637 1.944848 -0.483338
C  -3.097167 2.281804 1.754445
C  -4.441192 1.873955 -0.350789
C  -3.113763 -2.473241 -0.045805
C  -3.267812 -3.457083 -1.225352
C  0.234476 0.808425 -0.350818
C  2.539804 0.000332 0.285842
C  3.568668 0.162549 1.252655
C  2.713226 -0.920223 -0.781415
C  4.758395 -0.586471 1.155212
C  3.911344 -1.66247 -0.863088
C  4.93858 -1.506089 0.095673
H  -3.887839 -0.253086 1.448079
H  -2.127024 -0.238927 1.244143
H  -2.421055 -0.789279 -1.226282
H  -4.188339 -0.836857 -0.990411
H  -1.933421 1.387218 -1.436122
H  -2.013134 3.0298 -0.685289
H  -3.969197 2.019043 2.381872
H  -3.117438 3.375364 1.584055
H  -2.179038 2.043307 2.320012
H  -4.532511 2.970555 -0.467933
H  -4.475678 1.420509 -1.358023
H  -5.326046 1.519659 0.209558
H  -2.134267 -2.637813 0.447908
H  -3.888959 -2.685021 0.719829
H  -2.485727 -3.282327 -1.987852
H  -4.2508 -3.334126 -1.718812
H  -3.186501 -4.507954 -0.891066
H  1.3371 1.428413 1.243302
H  3.436022 0.873654 2.078291
H  1.921407 -1.041376 -1.52339
H  5.543401 -0.4511 1.907462
H  4.039673 -2.371127 -1.689103
H  5.862589 -2.088739 0.019632
