program: Gaussian 09
title: 000282967
version: EM64L-G09RevD.01
frameworkgroup: C1[X(C10H7Cl2NO)]
method: RPBEPBE
basis: SDD
operation: Freq
keyword: #p
keyword: freq=noraman
keyword: PBEPBE/SDD
title: #p freq=noraman PBEPBE/SDD
converged: NO NO NO NO
title: Mulliken charges:
elementType: Cl Cl O N C C C C C C C C C C H H H H H H H
charge: -0.054611 0.019006 -0.236744 -0.443629 0.404832 0.359960 0.361252 0.159926 -0.456840 -0.345438 -0.322275 -0.244191 -0.254076 -0.801601 0.321713 0.256790 0.262636 0.266737 0.242879 0.242877 0.260798
chargesum: 0.00000
title: Mulliken charges with hydrogens summed into heavy atoms:
elementType: Cl Cl O N C C C C C C C C C C
charge: -0.054611 0.019006 -0.236744 -0.121916 0.404832 0.359960 0.361252 0.159926 -0.200050 -0.345438 -0.322275 0.018444 0.012662 -0.055047
polarizability: 1.94068236e+02 -3.66255952e+00 1.69608279e+02 -9.72158066e-03 -5.70847487e-04 5.64108195e+01
1716.lowfreq: -0.0010 0.0008 0.0026 0.9776 4.1498 10.7683 47.2707 87.7474 111.9075
frequency: 47.2142 87.7451 111.8999 134.4393 172.3467 174.0449 208.6683 278.1678 299.4493 305.9910 309.0113 327.6715 419.8584 477.8923 480.4251 534.6644 545.3487 561.7347 591.2905 602.1391 639.3850 684.3193 687.1324 772.1153 799.3812 808.0877 866.8773 908.1496 936.3457 993.6382 1011.5114 1052.2724 1084.1553 1127.5659 1151.3823 1198.5668 1242.1175 1265.3201 1343.1615 1380.2158 1398.2191 1409.1599 1422.8425 1460.9459 1468.3283 1501.8855 1547.9060 1566.7195 1598.4308 1653.3648 2979.4621 3055.1197 3118.5922 3164.1512 3180.7527 3182.2716 3502.7793
redmass: 9.4763 9.0257 1.1276 4.7370 6.7490 3.0852 17.1997 5.4198 3.7985 5.8770 25.9347 11.2233 5.9356 6.9045 4.3196 7.4473 4.2055 7.8613 5.4787 3.2823 1.6289 2.8403 5.3533 5.0706 7.2001 1.3233 1.4906 5.5562 1.3420 3.4747 1.8019 1.5160 4.8288 1.8809 2.2152 1.8753 2.5292 2.2997 2.4786 4.5404 2.1535 1.5761 2.9544 1.2068 1.0430 3.2963 6.3267 5.3927 7.8861 5.3921 1.0394 1.0979 1.0969 1.0889 1.0929 1.0976 1.0771
irintensity: 4.9961 1.5887 0.0417 0.5299 3.8657 0.1079 0.8681 0.9403 1.8388 0.4287 0.5808 4.3868 0.4477 23.3096 7.0437 1.8279 2.7122 18.2193 1.9484 1.9169 47.5579 29.2323 10.8457 0.7015 6.6919 44.9239 35.1678 63.0645 0.0171 8.6141 48.0485 9.5582 33.1941 13.9463 10.1409 0.5159 26.0746 2.2126 5.3097 6.4407 55.9440 43.9060 16.3816 63.7002 18.4790 172.2534 110.1093 84.8467 82.1166 200.1246 20.3259 13.9601 8.9501 0.4426 2.2120 0.8453 77.6738
temp: 298.150 k
press: 1.00000 atm
elementType: 17 17 8 7 6 6 6 6 6 6 6 6 6 6 1 1 1 1 1 1 1
symmnumber: 1
zpe: 381803.9 jmol-1
zpe.correction: 0.145421 hartree
zpe.thermalcorrener: 0.157801 hartree
zpe.thermalcorrenthalpy: 0.158745 hartree
zpe.thermalcorrgfe: 0.106008 hartree
zpe.sumelectzpe: -1434.390860 hartree
zpe.sumelectthermal: -1434.378481 hartree
zpe.sumelectthermalent: -1434.377536 hartree
zpe.sumelectthermalfe: -1434.430273 hartree
dipole: 5.9783 -1.7274 0.0019
dipole: 6.2229
quadrupole: -94.2347 -88.6419 -96.9279
quadrupole: 17.9269 -0.0061 0.0061
quadrupole: -0.9666 4.6263 -3.6597 17.9269 -0.0061 0.0061
hfenergy: -1434.5362815 hartree
pointgroup: C01 [X(C10H7Cl2N1O1)]
dipole: 0.8955839 2.2785775 -0.0007463 debye
dipolederiv: -0.1839125 -0.2087602 -0.0000411 -0.0803982 -0.7854344 -0.0001064 -0.0000187 -0.0001171 -0.0458387 -0.2142086 -0.3068795 -0.0000886 -0.3378823 -0.5593642 -0.0002771 -0.0001527 -0.0003523 -0.0258496 -0.4937632 -0.0697691 0.0000301 0.0168344 -1.1216703 0.0003636 0.0000679 0.0005849 -0.3384607 -1.215772 0.3150234 0.0000271 0.0158265 -0.6716067 0.0000409 0.000041 -0.0000189 -0.2419337 0.8376018 -0.0949223 -0.0000784 0.1703477 -0.159233 -0.0000458 0.0000544 -0.0001566 0.1095962 -0.434812 0.3082979 -0.0001434 -0.083195 -0.4491623 0.0000555 0.0000166 -0.0000024 0.023184 0.7845588 -0.2393191 -0.0000249 -0.1052337 0.9907835 -0.0000032 -0.0001233 -0.0000065 0.0298975 0.9179939 0.234501 -0.0001358 -0.1634633 1.2033381 -0.0007152 -0.0001242 -0.0006867 0.172777 -0.4704415 -0.5516521 0.0001109 -0.1660806 -0.4750691 0.0001382 0.0000131 0.0000769 -0.2293653 -0.1773997 0.2018235 0.0000457 0.2794643 1.0910326 0.0001638 0.0000602 0.000152 -0.1138996 0.4525075 0.118198 0.0002453 0.6263827 0.9683633 0.0005369 0.0002391 0.0005442 -0.0628453 0.1165057 0.114467 0.0000171 0.0037707 0.0121865 0.0000069 0.0000157 0.0000827 -0.0761165 -0.0898849 0.0918585 0.0000068 -0.1238604 -0.4628644 -0.0000978 -0.0000375 -0.000112 -0.1325585 -0.1806528 -0.0030891 0.0000179 -0.1248338 0.0034857 0.000013 0.0000021 -0.0000253 0.0741279 0.2366743 -0.0017924 0.0000036 -0.041721 0.2580064 -0.0000207 -0.0000069 -0.0000128 0.2885387 -0.0225635 0.0472209 0.0000376 0.0698005 0.0502329 0.0000005 0.0000218 0.000129 0.1635387 0.0567481 0.0603882 0.0000011 0.0647961 0.0192404 -0.0000267 0.0000102 -0.0000259 0.1654148 -0.0246123 -0.0175064 -0.0000324 -0.0414788 0.06745 -0.0000214 -0.0000654 -0.0000469 0.1686055 0.042241 -0.0180577 0.010968 -0.0606514 0.0183702 -0.1049952 -0.0470169 -0.1125845 -0.0275711 0.0422533 -0.0180154 -0.0109876 -0.0606247 0.0183043 0.1050362 0.0469657 0.1126019 -0.0274912 0.0209387 0.0379851 0.0000209 0.1422002 -0.0163894 -0.0000461 0.0000378 -0.0000236 0.1262499 unknown
polarizability: 175.1629661|10.8824262|188.5135484|0.0063804|0.007357|56.4108195 unknown
InChI: InChI=1S/C10H7Cl2NO/c1-5-4-8(14)9-6(11)2-3-7(12)10(9)13-5/h2-4,13H,1H3
charge 0 multiplicity 1
21 atoms
Cl -0.369625 3.531681 0.000544
Cl -2.456206 -2.556533 -0.000957
O  0.446078 -2.944355 0.001431
N  1.398578 1.085307 0.00018
C  0.044469 0.75311 0.000143
C  -0.363833 -0.6261 0.000006
C  2.415522 0.135683 -0.000064
C  0.703418 -1.695067 0.000242
C  2.084012 -1.203286 -0.000132
C  -0.932019 1.788636 0.000261
C  -1.768081 -0.87974 -0.00023
C  -2.298904 1.506063 0.000152
C  -2.719447 0.15604 -0.00015
C  3.826499 0.67342 -0.00013
H  1.63153 2.082663 0.000398
H  2.870131 -1.962486 -0.000185
H  -3.034207 2.315354 0.000263
H  -3.785822 -0.085061 -0.000354
H  4.01868 1.296834 0.894112
H  4.01847 1.297209 -0.894154
H  4.550956 -0.154574 -0.000376
