program: Gaussian 09
title: 000282962
version: EM64L-G09RevD.01
frameworkgroup: C1[X(C9H5Cl2N)]
method: RPBEPBE
basis: SDD
operation: Freq
keyword: #p
keyword: freq=noraman
keyword: PBEPBE/SDD
title: #p freq=noraman PBEPBE/SDD
converged: NO YES NO YES
title: Mulliken charges:
elementType: Cl Cl N C C C C C C C C C H H H H H
charge: 0.002490 -0.039422 0.015266 0.456965 0.042184 -0.388455 -0.198806 -0.304037 -0.117331 -0.224574 -0.171069 -0.357425 0.263804 0.250496 0.284388 0.236465 0.249064
chargesum: 0.00000
title: Mulliken charges with hydrogens summed into heavy atoms:
elementType: Cl Cl N C C C C C C C C C
charge: 0.002490 -0.039422 0.015266 0.456965 0.042184 -0.124651 -0.198806 -0.053541 -0.117331 0.059814 0.065396 -0.108362
polarizability: 1.86177881e+02 7.42812106e+00 1.41522293e+02 5.51215763e-03 -5.18464215e-03 4.45506618e+01
1716.lowfreq: -10.9595 -0.0034 -0.0008 0.0021 7.1894 9.0784 93.4401 125.8681 176.9372
frequency: 93.4390 125.8666 176.9372 191.9302 200.2168 282.0648 337.7627 383.2357 422.2789 451.0434 508.1843 542.5992 547.9730 596.8911 627.3666 683.6271 795.8315 808.5371 809.1114 846.3770 869.5600 881.8635 942.7673 954.1709 989.5384 1031.4777 1084.0007 1130.0201 1190.2384 1226.4133 1227.1272 1338.2009 1349.1458 1379.4562 1408.9962 1432.6591 1478.8841 1539.4347 1586.0625 1604.7155 3129.9487 3138.1849 3157.5048 3170.4961 3180.9818
redmass: 6.1697 7.9947 19.9877 4.3872 9.0376 4.9247 16.8906 12.2901 4.0876 5.2408 4.1651 6.9634 4.1462 7.7674 3.0838 8.4201 1.3029 4.0972 7.3855 7.1046 1.4303 1.5189 1.4372 6.4637 1.3828 2.5402 1.9945 1.5561 1.7559 1.6357 2.3981 4.3643 2.1466 2.5525 3.4919 2.7672 4.3564 7.7480 6.2892 7.4049 1.0888 1.0914 1.0933 1.0994 1.0933
irintensity: 0.9236 2.2392 0.5779 1.8693 1.4817 2.2500 3.4288 2.2313 0.5213 4.3707 0.8588 0.5903 7.2171 9.4931 1.1773 38.6913 36.0500 6.8583 44.0972 22.2175 31.3214 35.5131 0.5111 37.8946 1.1974 3.2119 8.4551 7.7093 12.8352 4.4420 24.0699 6.2037 34.5386 8.9674 4.6992 32.0879 62.4120 42.5278 36.0851 21.1670 10.6353 10.5972 1.5661 23.8278 1.1634
temp: 298.150 k
press: 1.00000 atm
elementType: 17 17 7 6 6 6 6 6 6 6 6 6 1 1 1 1 1
symmnumber: 1
zpe: 298187.9 jmol-1
zpe.correction: 0.113574 hartree
zpe.thermalcorrener: 0.123027 hartree
zpe.thermalcorrenthalpy: 0.123971 hartree
zpe.thermalcorrgfe: 0.077825 hartree
zpe.sumelectzpe: -1320.005175 hartree
zpe.sumelectthermal: -1319.995722 hartree
zpe.sumelectthermalent: -1319.994778 hartree
zpe.sumelectthermalfe: -1320.040924 hartree
dipole: -0.7991 -3.5384 0.0002
dipole: 3.6275
quadrupole: -79.8231 -76.1922 -85.5139
quadrupole: 9.4559 -0.0004 -0.0001
quadrupole: 0.6866 4.3175 -5.0042 9.4559 -0.0004 -0.0001
hfenergy: -1320.1187488 hartree
pointgroup: C01 [X(C9H5Cl2N1)]
dipole: -0.5857902 1.3014184 -0.0000599 debye
dipolederiv: -0.0657649 -0.0491404 0.000005 -0.0108507 -0.795653 0.0000542 0.0000011 0.0000515 -0.0343932 -0.8308108 -0.2045888 0.0000436 -0.2822316 -0.2070918 0.0000209 0.0000503 0.0000183 -0.0572277 -0.3236852 -0.0154066 -0.0000011 0.0739252 -0.2753183 0.0000032 -0.0000072 0.000004 -0.2145707 0.1191335 0.0340216 -0.0000066 0.231965 -0.1410937 0.0000047 -0.0000222 0.0000148 0.0946829 0.1648508 0.0454133 0.000002 -0.1638233 -0.2655105 0.0000263 0.0000137 0.0000197 0.0500689 -0.4174996 -0.038318 0.0000137 -0.0243176 -0.0604422 -0.0000049 0.0000178 -0.0000084 -0.1419637 0.1767791 0.1292542 -0.0000183 -0.0460315 1.2786615 -0.0000927 -0.0000044 -0.0000955 -0.0565857 0.0823502 0.0088104 -0.0000053 -0.0552411 0.1745813 -0.0000131 -0.0000037 -0.0000142 -0.1381671 1.237199 0.3529494 -0.0000765 0.437656 0.4118685 -0.0000493 -0.0000875 -0.0000457 -0.0549498 -0.3653452 -0.2615853 0.0000284 -0.1832808 -0.3476152 0.0000274 0.0000236 0.0000291 -0.0741333 -0.1151863 -0.1332267 0.0000051 -0.2537439 -0.0786194 0.000005 0.0000041 0.0000015 -0.1002636 0.2787674 0.083023 -0.0000045 0.2388124 0.2500247 -0.0000217 -0.0000024 -0.0000165 -0.0559157 0.0779641 0.0087536 0.0000028 -0.039771 -0.0307194 0.0000149 0.0000073 0.000016 0.1729174 0.0825873 -0.0556857 0.0000043 0.0049381 -0.0763661 0.000011 0.0000041 0.0000112 0.146444 0.0561117 0.04487 0.0000013 0.0351188 0.0690326 0.0000057 0.0000035 0.0000064 0.1706174 -0.047032 0.0954774 0.0000008 0.102417 0.0331315 0.0000042 0.0000013 0.0000036 0.1642563 -0.1104192 -0.0446214 0.0000052 -0.0655409 0.0611295 0.0000042 0.0000008 0.0000042 0.1291836 unknown
polarizability: 187.3048353|1.8926553|140.3953384|-0.004367|-0.0061801|44.5506618 unknown
InChI: InChI=1S/C9H5Cl2N/c10-7-4-6-2-1-3-12-9(6)8(11)5-7/h1-5H
charge 0 multiplicity 1
17 atoms
Cl 0.39446 -3.159246 0.000222
Cl 3.788878 1.201553 -0.000206
N  -1.814455 -1.064717 0.00011
C  -0.316162 0.923149 -0.00003
C  -0.54577 -0.512067 0.000058
C  1.014271 1.450333 -0.000102
C  0.611547 -1.36568 0.000091
C  -1.472063 1.772792 -0.000045
C  2.084894 0.562989 -0.000089
C  1.907677 -0.850263 0.000015
C  -2.745855 1.20398 0.000013
C  -2.865914 -0.223463 0.000092
H  1.177521 2.532497 -0.000182
H  -1.338114 2.860378 -0.000099
H  2.773771 -1.516706 0.000027
H  -3.647181 1.824215 0.000005
H  -3.856806 -0.69274 0.000119
