program: Gaussian 09
title: 000282950
version: EM64L-G09RevD.01
frameworkgroup: C1[X(C10H10O2S)]
method: RPBEPBE
basis: SDD
operation: Freq
keyword: #p
keyword: freq=noraman
keyword: PBEPBE/SDD
title: #p freq=noraman PBEPBE/SDD
converged: YES YES NO NO
title: Mulliken charges:
elementType: S O O C C C C C C C C C C H H H H H H H H H H
charge: 0.912238 -0.546640 -0.553169 -0.315505 -0.673833 -0.076864 0.508143 -0.384099 -0.449599 -0.382155 -0.214613 -0.231534 -0.240250 0.256128 0.307347 0.304944 0.272633 0.292150 0.231199 0.283998 0.230787 0.234858 0.233833
chargesum: 0.00000
title: Mulliken charges with hydrogens summed into heavy atoms:
elementType: S O O C C C C C C C C C C
charge: 0.912238 -0.546640 -0.553169 -0.059377 -0.061542 0.195769 0.508143 -0.091949 -0.218400 -0.098156 0.016175 0.003324 -0.006417
polarizability: 1.81542027e+02 2.78385664e+00 1.25882091e+02 1.09610453e+00 4.73067734e+00 8.50649805e+01
1716.lowfreq: -15.6408 -10.3258 0.0008 0.0013 0.0014 2.0652 42.9004 59.1917 85.0225
frequency: 42.8402 59.0800 85.0188 147.7720 172.8636 226.6268 253.1774 271.7346 293.5483 342.5990 401.0705 405.0104 474.8077 531.2694 542.7158 568.2050 604.3007 615.4963 707.7746 715.1887 753.8157 773.4074 791.3073 807.3097 859.8413 869.1373 908.1870 926.2958 935.7780 949.0974 985.0600 989.3624 1005.6945 1013.6554 1028.7499 1085.5392 1093.0815 1122.3003 1175.0007 1186.1137 1199.1625 1201.5977 1238.8108 1256.9614 1288.6955 1343.6607 1384.0622 1415.1672 1444.3786 1484.5057 1593.7941 1606.6107 1613.2471 3005.7844 3070.1644 3101.6238 3117.0178 3134.5680 3143.1934 3148.0870 3165.8547 3170.0064 3230.3998
redmass: 4.2709 6.4290 6.1432 5.7370 5.0362 5.3376 3.3628 4.9765 5.1476 5.8687 3.2912 2.9124 7.9584 4.1074 5.7649 4.1071 4.3104 6.2797 1.7692 1.8739 1.9365 2.5897 3.2508 8.6493 1.2494 2.4546 2.3370 1.4368 1.7440 3.3066 1.4186 5.2378 1.3680 1.7301 2.1082 1.6012 1.3646 1.2434 1.0610 1.3653 1.1250 1.5904 1.4758 1.4762 1.5422 1.2596 7.2403 1.1049 2.1152 2.1928 6.0181 6.1533 6.1965 1.0837 1.0567 1.0924 1.0879 1.0889 1.0912 1.0949 1.1011 1.1120 1.1046
irintensity: 1.4266 5.8944 0.2894 2.0971 1.7936 2.4652 4.2856 15.7447 8.6789 14.6336 0.2903 0.1282 11.7581 1.5747 40.9689 6.0975 5.5111 2.2218 52.4549 54.9813 29.5657 43.0491 8.6202 76.0318 0.4532 10.8732 22.0352 2.1944 6.0734 117.4419 0.3044 2.5111 0.9384 4.9276 4.3028 5.4563 1.6341 5.3642 0.1655 1.3615 0.6787 1.9685 12.7667 3.6325 4.2553 1.4006 0.2143 15.0253 13.2955 20.9342 1.8929 13.0445 0.3589 8.9533 2.0414 2.5491 7.7296 3.1213 3.1272 24.8386 29.1153 0.2087 5.9857
temp: 298.150 k
press: 1.00000 atm
elementType: 16 8 8 6 6 6 6 6 6 6 6 6 6 1 1 1 1 1 1 1 1 1 1
symmnumber: 1
zpe: 455042.6 jmol-1
zpe.correction: 0.173317 hartree
zpe.thermalcorrener: 0.185107 hartree
zpe.thermalcorrenthalpy: 0.186052 hartree
zpe.thermalcorrgfe: 0.134741 hartree
zpe.sumelectzpe: -934.439980 hartree
zpe.sumelectthermal: -934.428189 hartree
zpe.sumelectthermalent: -934.427245 hartree
zpe.sumelectthermalfe: -934.478556 hartree
dipole: -5.4468 -4.0626 0.9882
dipole: 6.8665
quadrupole: -98.2270 -82.8823 -80.1100
quadrupole: -5.6723 5.2851 0.4312
quadrupole: -11.1539 4.1908 6.9631 -5.6723 5.2851 0.4312
hfenergy: -934.6132962 hartree
pointgroup: C01 [X(C10H10O2S1)]
dipole: 1.9745155 -1.1428153 -1.4468157 debye
dipolederiv: 1.5020464 -0.0381092 -0.0691199 0.0404172 1.1357637 0.0447923 -0.2453557 0.1743399 1.16864 -0.8542675 0.0273211 0.0756236 -0.1160834 -0.4893681 0.0314989 0.0385978 -0.0232989 -0.5196458 -0.6505499 -0.0511061 -0.0372506 0.0320918 -0.637036 -0.0973987 0.0923813 -0.1063618 -0.5864136 0.0323816 0.0772929 -0.0168068 0.1647454 0.0750573 0.04767 -0.0700242 0.0943087 0.0523325 -0.1968049 0.0449784 -0.0286456 -0.0007197 -0.1041404 0.0371193 -0.0138409 -0.0146052 -0.0837038 0.0803075 -0.1385873 0.0026132 -0.3102481 -0.0130202 -0.038263 0.1962923 -0.0652652 -0.0873113 0.3012449 -0.024381 0.0186576 0.1589518 -0.064872 0.0152572 0.0488152 0.036636 -0.0706475 -0.4195446 -0.0437088 -0.1014976 0.0007153 -0.2436666 -0.0287608 -0.0252412 -0.1091739 -0.0944813 -0.1246209 0.0261805 0.0232778 -0.0515731 0.0352127 0.103983 -0.0512929 0.1093084 -0.1043811 -0.1361574 -0.0292854 -0.0237951 -0.0568889 -0.0943907 0.0180305 -0.0556191 0.0201327 -0.1071324 0.0350768 -0.0808922 -0.0423636 -0.1072905 -0.0165641 0.0595328 -0.049235 0.0615376 -0.1060303 -0.0391292 0.0190774 0.0167815 0.029155 0.0823952 0.1271607 0.0435214 0.1272801 -0.0608771 0.055526 0.0561427 0.0397164 0.0641899 -0.0766545 0.0559948 0.0425986 0.053119 -0.1271704 0.0270897 0.0637898 0.0413891 -0.0058744 -0.0546351 -0.061052 0.0043863 -0.0697851 0.0441114 -0.0435955 -0.008083 0.0176628 -0.0280767 -0.0084582 0.0075794 0.0236843 -0.0132437 0.1005665 0.08648 0.0232961 -0.059679 0.0498535 0.061208 -0.0158013 -0.048651 -0.0114969 0.0141102 0.1098468 0.0218968 0.1253907 0.0434082 0.1326515 -0.0054299 0.0513934 0.036089 0.0034871 0.1455582 0.0420812 0.0430984 0.089213 0.1377865 0.0443071 0.0602713 0.0533283 0.0259245 0.0875247 -0.06397 -0.0348444 -0.0321888 -0.0411455 -0.1071382 -0.0171778 -0.1074131 0.083027 0.1043974 0.0559985 0.0264077 0.0458229 0.0825414 -0.023075 0.0025392 -0.030417 0.1100041 -0.0659743 0.089461 0.0403312 0.0918856 0.0427685 -0.0619032 0.0498491 -0.0615992 0.1247774 0.0671349 -0.0124531 -0.0111348 -0.0416939 -0.0317762 -0.1101356 -0.028086 -0.1093813 0.087973 -0.1039707 -0.0569403 -0.0458124 -0.0598121 0.0903428 -0.0439683 -0.0498066 -0.0440385 0.1328411 unknown
polarizability: 180.2812519|-8.2261444|113.9556243|-3.2632109|20.0645361|98.2522224 unknown
InChI: InChI=1S/C10H10O2S/c11-13(12)7-6-10(8-13)9-4-2-1-3-5-9/h1-7,10H,8H2
charge 0 multiplicity 1
23 atoms
S  -2.551715 0.565239 0.51631
O  -4.105572 0.079994 0.641562
O  -2.014656 1.819231 1.426447
C  -0.375785 -0.875299 -0.541319
C  -1.324921 -0.960523 0.672425
C  -0.986145 0.063382 -1.597312
C  1.041974 -0.398795 -0.187306
C  -2.040687 0.837183 -1.281359
C  2.167719 -1.160639 -0.583086
C  1.235881 0.814471 0.523859
C  3.475565 -0.723088 -0.269872
C  2.542355 1.247045 0.838743
C  3.665372 0.48255 0.442194
H  -0.302271 -1.879861 -1.000303
H  -2.001109 -1.827388 0.650715
H  -0.835897 -0.832148 1.646622
H  -0.501861 0.102984 -2.580228
H  -2.586011 1.596725 -1.841065
H  2.024821 -2.101564 -1.12946
H  0.372462 1.416173 0.839715
H  4.339831 -1.32274 -0.576128
H  2.683796 2.181895 1.39214
H  4.677252 0.822776 0.688307
