program: Gaussian 09
title: 000282929
version: EM64L-G09RevD.01
frameworkgroup: C1[X(C10H7Cl2NO3)]
method: RPBEPBE
basis: SDD
operation: Freq
keyword: #p
keyword: freq=noraman
keyword: PBEPBE/SDD
title: #p freq=noraman PBEPBE/SDD
converged: NO YES NO NO
title: Mulliken charges:
elementType: Cl Cl O O O N C C C C C C C C C C H H H H H H H
charge: -0.047746 -0.039490 -0.250643 -0.415287 -0.241097 -0.469204 0.651388 -0.406629 -0.261759 -0.108812 -0.193491 -0.249731 0.243882 -0.296035 -0.205029 0.171436 0.340559 0.319968 0.262470 0.265941 0.252573 0.291933 0.384804
chargesum: 0.00000
title: Mulliken charges with hydrogens summed into heavy atoms:
elementType: Cl Cl O O O N C C C C C C C C C C
charge: -0.047746 -0.039490 -0.250643 -0.030483 -0.241097 -0.149236 0.651388 -0.406629 0.078800 -0.108812 0.068979 0.016210 0.243882 -0.043462 0.086904 0.171436
polarizability: 2.75646075e+02 3.44434403e+00 1.71737821e+02 2.05803031e-03 -1.86970626e-03 5.40916065e+01
1716.lowfreq: -4.6200 -3.1958 -0.0018 -0.0008 0.0011 6.6783 33.6437 41.0479 50.0216
frequency: 33.6323 40.9945 50.0198 84.3591 97.2416 122.4605 150.0957 170.3942 170.6255 241.0525 254.1221 267.0093 304.0956 313.2455 313.9514 417.5759 444.7041 462.3746 513.3376 563.3855 579.5155 585.6128 596.3388 654.8640 686.3964 694.4263 722.1117 736.1519 751.8697 799.5500 882.7984 912.4689 921.4092 925.6962 937.8045 969.8037 997.3275 1010.7556 1059.0482 1079.3624 1133.0132 1156.2093 1220.4964 1239.5408 1261.5703 1309.0529 1327.4650 1369.4524 1406.6934 1439.4718 1505.7339 1571.2048 1597.8723 1604.1743 1629.7707 1662.2693 3113.6249 3167.2758 3169.7104 3186.5197 3190.1677 3477.3216 3520.2598
redmass: 8.5492 9.2396 11.0630 6.2709 10.5026 12.1652 5.7309 13.3600 2.7389 9.2588 5.0412 9.7265 12.7895 16.9045 5.2492 5.7731 3.2110 5.4730 8.0972 2.4172 6.1056 2.2806 6.1080 1.9764 1.5291 7.4150 3.2375 4.7479 6.6780 1.3272 6.3106 2.1753 1.3860 5.5023 1.3487 4.2934 1.0888 6.9511 2.1929 1.8612 1.5163 1.8158 1.4709 1.6950 1.6365 1.6121 2.4945 6.7882 4.0927 2.6908 2.5230 5.8660 6.1773 4.9604 8.7221 6.2057 1.0926 1.0893 1.0927 1.0976 1.0939 1.0765 1.0641
irintensity: 1.2263 0.2032 0.1723 2.0451 5.1195 3.1402 1.9669 2.8033 1.6690 1.7378 0.2171 0.7277 3.4576 2.6774 2.0889 10.8724 18.9064 39.0805 37.1369 23.6044 44.0920 53.1570 4.9725 83.2213 33.4405 4.5885 0.5461 68.3108 4.2376 47.4972 59.6764 5.2641 27.2327 23.5335 6.6444 7.7403 63.8691 72.2057 403.3479 25.2459 2.4990 33.0585 55.8917 6.0985 10.6048 44.6540 213.9272 108.7786 81.2795 64.8359 366.4839 66.9452 79.3825 49.4989 209.3765 46.7931 1.7353 0.4629 1.8885 0.0165 20.8260 59.2580 63.8286
temp: 298.150 k
press: 1.00000 atm
elementType: 17 17 8 8 8 7 6 6 6 6 6 6 6 6 6 6 1 1 1 1 1 1 1
symmnumber: 1
zpe: 399414.3 jmol-1
zpe.correction: 0.152129 hartree
zpe.thermalcorrener: 0.167267 hartree
zpe.thermalcorrenthalpy: 0.168211 hartree
zpe.thermalcorrgfe: 0.107368 hartree
zpe.sumelectzpe: -1584.673568 hartree
zpe.sumelectthermal: -1584.658430 hartree
zpe.sumelectthermalent: -1584.657486 hartree
zpe.sumelectthermalfe: -1584.718329 hartree
dipole: 0.1314 2.3205 0.0002
dipole: 2.3243
quadrupole: -89.1757 -113.8564 -108.0731
quadrupole: 11.3268 -0.0020 0.0009
quadrupole: 14.5260 -10.1546 -4.3714 11.3268 -0.0020 0.0009
hfenergy: -1584.8256966 hartree
pointgroup: C01 [X(C10H7Cl2N1O3)]
dipole: -0.1119446 -0.9075541 -0.0001413 debye
dipolederiv: -0.2031348 0.2301281 0.0000568 0.1092616 -0.6748665 -0.0001306 0.0000354 -0.000127 -0.0415953 -0.2851482 0.2458655 0.0000534 0.3919099 -0.6724917 -0.0001188 0.0000838 -0.000122 -0.0575148 -0.6799467 0.0914638 -0.0000026 -0.3881978 -0.8384726 -0.0000198 -0.0002374 -0.0002556 -0.3402199 -1.203005 -0.5901411 -0.0004333 -0.5901753 -0.6545398 -0.0002627 -0.0005619 -0.000326 -0.4288331 -0.8971343 0.146386 -0.0000189 0.2544028 -0.876611 -0.0003069 -0.0000729 -0.000217 -0.3263117 -1.6148878 -0.2971306 -0.0000911 -0.4703977 -0.5235888 -0.0000673 -0.0001525 -0.0000746 -0.3009719 0.9873627 0.1395968 -0.0000187 -0.2166492 -0.1037996 -0.0000511 -0.0001489 -0.0000704 0.137368 -0.0218179 -0.3504824 -0.0000866 -0.1844254 0.9286298 0.0002309 -0.0000266 0.0002081 -0.1280497 -0.3570963 0.0453854 0.000007 0.1990399 -0.2835366 -0.0000511 0.0000415 -0.0000272 -0.1096571 0.4245778 -0.3718634 -0.0000973 -0.6908997 1.0761733 0.0002125 -0.0001473 0.000229 -0.0638314 0.0272814 -0.0092457 -0.000012 0.1514814 -0.0910916 -0.0000123 0.0000123 -0.000002 -0.0687745 -0.1690514 0.06034 -0.0000035 0.1102917 -0.3132631 -0.000034 0.000024 -0.0000345 -0.1276159 1.6186073 0.1924551 0.0001426 0.7686569 1.0794143 0.0001123 0.0005679 0.0003502 0.2476726 0.0021995 0.0726952 0.0000216 0.1542519 0.0537438 0.00009 0.0000062 0.0000742 -0.1427674 -0.8923455 -0.0241519 -0.0000929 0.0817179 0.0431694 0.0000472 -0.0001785 0.0000186 -0.0841402 2.3070059 0.296151 0.0005399 -0.0569124 1.235626 0.0006099 0.0006179 0.0006074 0.2496322 0.2083584 -0.0228522 0.0000069 -0.0052101 0.0927305 -0.0000182 0.0000099 -0.0000223 0.1884548 0.2141456 0.0331939 0.0000217 0.1682852 0.2244933 -0.0000177 0.0000958 -0.0000005 0.3034716 0.0566574 -0.0434461 0.0000013 -0.0609016 0.00008 -0.0000227 -0.0000016 -0.0000233 0.1662376 -0.0197236 0.0192082 0.0000225 0.0252789 0.085065 -0.0000178 0.0000236 -0.0000194 0.1752858 0.0646426 -0.0083883 -0.0000204 0.0201099 -0.0342505 -0.0000742 -0.0000388 -0.0000664 0.1720631 0.1233065 0.028718 -0.0000082 0.0588337 0.0400112 -0.0000428 -0.0000195 -0.000043 0.1743916 0.3091463 0.1161148 0.0000119 0.1702472 0.2073754 -0.0000548 0.0000677 -0.0000562 0.4057058 unknown
polarizability: 275.6463409|-3.4403228|171.7375471|0.0091095|0.0296311|54.0916144 unknown
InChI: InChI=1S/C10H7Cl2NO3/c11-6-1-2-7(12)8(5-6)13-9(14)3-4-10(15)16/h1-5,13,15H
charge 0 multiplicity 1
23 atoms
Cl -1.641307 -3.121124 -0.000673
Cl -4.145313 2.795013 0.000562
O  0.774562 1.661045 0.00035
O  5.785891 0.916128 0.001248
O  5.048031 -1.295712 -0.000102
N  -0.071436 -0.540947 -0.000402
C  -1.463793 -0.311755 -0.000221
C  -2.346694 -1.429885 -0.000324
C  -2.03617 0.991173 0.000056
C  -3.434435 1.120255 0.00022
C  -3.740747 -1.281485 -0.000152
C  -4.306206 0.014029 0.000123
C  0.962087 0.40619 -0.000243
C  2.319761 -0.215458 -0.000184
C  3.442057 0.55455 0.000337
C  4.7871 -0.067114 0.000393
H  -1.373735 1.858419 0.000125
H  0.201727 -1.530027 -0.000636
H  -4.38497 -2.164782 -0.000233
H  -5.390672 0.148224 0.000255
H  2.42306 -1.309708 -0.00055
H  3.371163 1.646973 0.000725
H  6.680237 0.478496 0.00133
