program: Gaussian 09
title: 000282960
version: EM64L-G09RevD.01
frameworkgroup: C1[X(C14H15Cl2NO4)]
method: RPBEPBE
basis: SDD
operation: Freq
keyword: #p
keyword: freq=noraman
keyword: PBEPBE/SDD
title: #p freq=noraman PBEPBE/SDD
converged: YES YES NO NO
title: Mulliken charges:
elementType: Cl Cl O O O O N C C C C C C C C C C C C C C H H H H H H H H H H H H H H H
charge: -0.021189 -0.042896 -0.230600 -0.245587 -0.348047 -0.298047 -0.408650 0.678154 -0.051959 -0.158485 -0.414760 -0.290052 -0.118915 -0.178413 0.239443 0.228255 -0.257483 -0.262038 -0.263648 -0.668555 -0.669159 0.403359 0.275478 0.270346 0.261961 0.266003 0.224769 0.234850 0.233288 0.221683 0.250006 0.229853 0.217151 0.251288 0.215326 0.227271
chargesum: 0.00000
title: Mulliken charges with hydrogens summed into heavy atoms:
elementType: Cl Cl O O O O N C C C C C C C C C C C C C C
charge: -0.021189 -0.042896 -0.230600 -0.245587 -0.348047 -0.298047 -0.005291 0.678154 -0.051959 0.116992 -0.414760 -0.019706 -0.118915 0.083548 0.239443 0.228255 0.008520 0.197580 0.191323 0.028455 0.024725
polarizability: 3.48116119e+02 -8.39585058e+00 2.32977985e+02 6.20387491e+00 2.09982332e-01 9.59058878e+01
1716.lowfreq: -8.6818 -5.8048 -0.0016 0.0011 0.0014 2.5038 4.7720 11.4034 33.1280
frequency: -8.6009 10.5770 33.0835 43.3383 47.3040 72.6257 83.7093 90.9960 91.3072 106.2521 126.3211 141.5901 161.9443 198.4393 202.9411 219.9082 255.9945 262.5252 273.7856 310.9770 315.7881 325.6046 331.2258 369.8211 391.4606 435.7748 439.4521 444.4741 450.6137 468.4486 547.0599 569.9443 576.8880 646.9197 681.6907 689.1441 702.7916 728.2583 747.0853 754.9073 797.7441 806.0792 818.4540 820.9152 858.8847 863.9864 896.6578 934.6716 943.5657 995.8740 1009.9802 1012.9713 1016.4436 1042.4038 1087.6053 1094.5475 1095.1833 1130.9704 1153.4388 1154.7705 1179.7408 1227.3516 1245.0770 1269.8916 1277.4107 1278.4374 1320.8214 1341.1410 1352.0047 1364.4508 1376.8517 1387.5680 1388.6858 1392.2975 1419.0470 1452.9221 1455.4926 1461.1569 1461.7705 1479.6510 1485.1357 1485.7223 1545.8503 1557.0025 1575.0410 1604.0454 1633.4363 2992.2067 2992.9954 3029.9166 3033.7897 3086.9892 3088.3566 3093.8953 3095.7684 3109.0204 3119.5905 3121.9348 3158.7630 3168.2196 3179.8138 3188.7896
redmass: 4.8746 6.9614 3.8223 3.2836 7.4539 3.9934 4.5681 4.4131 8.8963 8.0639 2.9926 4.6500 6.6009 4.6177 1.5787 1.2786 3.3666 3.9625 6.4917 21.2698 3.9358 3.7841 4.0526 5.2019 3.4412 3.3503 3.8331 9.3217 3.8667 6.9505 5.8945 7.1595 4.9462 5.3906 11.1770 5.2553 3.5436 4.5387 7.1613 2.5913 1.3305 1.5259 2.4898 1.5723 1.6179 3.5836 4.5374 1.3373 1.5250 2.7770 2.8824 1.1085 5.7831 5.9301 1.9406 2.1688 2.1516 1.5804 1.6887 1.6579 3.1493 3.0240 2.3662 1.3887 1.1260 1.1218 2.2346 1.4254 1.5655 2.0314 2.7855 1.3978 1.2676 2.7266 4.0957 1.1236 1.1176 1.0468 1.0445 3.8652 1.0527 1.0536 4.1980 7.4162 5.2304 7.9057 3.8049 1.0361 1.0361 1.0593 1.0591 1.0972 1.0970 1.1031 1.1032 1.0831 1.1059 1.1066 1.0902 1.0893 1.0913 1.0977
irintensity: 0.1667 0.4102 1.2235 1.3683 0.2531 0.0562 0.2835 0.2600 0.3136 2.4305 0.3939 1.5996 0.1930 2.5455 0.1401 4.7229 1.7867 2.7482 3.2683 0.9164 18.1634 6.3856 14.3593 5.5605 6.8223 20.6135 4.0324 2.9656 5.0402 27.3469 22.3588 13.9315 6.5386 1.5647 0.8978 8.0093 0.2617 20.9093 17.1976 1.1321 37.7012 3.2037 2.2123 8.4941 27.3566 2.8686 55.6025 0.0530 14.9800 12.6811 51.7712 103.1302 85.4232 220.1052 43.7045 9.3416 50.1979 11.5053 24.6790 19.9528 628.9402 384.4734 395.9389 20.0800 10.6453 15.1300 28.0805 114.1035 28.5736 3.1449 124.8951 47.1215 33.4510 125.5863 107.3326 27.1489 29.5768 8.1476 19.4614 25.6643 23.4689 5.8676 51.2453 402.2642 38.4258 125.9096 978.6521 23.7372 24.9284 36.4914 38.5128 43.6478 40.0243 0.6809 0.8389 169.0614 33.7553 32.0362 14.5221 1.3410 3.0693 0.2445
temp: 298.150 k
press: 1.00000 atm
elementType: 17 17 8 8 8 8 7 6 6 6 6 6 6 6 6 6 6 6 6 6 6 1 1 1 1 1 1 1 1 1 1 1 1 1 1 1
symmnumber: 1
zpe: 701993.6 jmol-1
zpe.correction: 0.267375 hartree
zpe.thermalcorrener: 0.288473 hartree
zpe.thermalcorrenthalpy: 0.289417 hartree
zpe.thermalcorrgfe: 0.214254 hartree
zpe.sumelectzpe: -1816.714370 hartree
zpe.sumelectthermal: -1816.693273 hartree
zpe.sumelectthermalent: -1816.692329 hartree
zpe.sumelectthermalfe: -1816.767492 hartree
dipole: -1.0135 1.5644 0.3417
dipole: 1.8951
quadrupole: -110.5337 -137.9706 -138.1241
quadrupole: 4.6003 0.1486 0.0595
quadrupole: 18.3425 -9.0944 -9.2480 4.6003 0.1486 0.0595
hfenergy: -1816.9817456 hartree
pointgroup: C01 [X(C14H15Cl2N1O4)]
dipole: -0.3922384 0.6339367 0.0122312 debye
polarizability: 344.7113903|-7.4347355|230.5736766|28.7905498|-19.6866313|101.7149245 unknown
InChI: InChI=1S/C14H15Cl2NO4/c1-3-20-13(18)10(14(19)21-4-2)8-17-12-7-9(15)5-6-11(12)16/h5-8,17H,3-4H2,1-2H3
charge 0 multiplicity 1
36 atoms
Cl 2.437658 3.061624 -0.273362
Cl 4.916647 -2.744622 0.884259
O  -3.272633 1.207062 -0.86767
O  -3.605053 -1.403889 -0.530566
O  -1.122347 2.053613 -0.662968
O  -1.7345 -2.701517 -0.05113
N  0.87267 0.459507 -0.141953
C  2.254011 0.280497 0.083056
C  -1.447978 -0.315527 -0.363353
C  -0.078278 -0.51508 -0.134873
C  3.124672 1.406343 0.053689
C  2.83216 -0.993624 0.341472
C  4.214845 -1.097946 0.555716
C  4.507183 1.2843 0.269741
C  -1.922647 1.052156 -0.634084
C  -2.247577 -1.569671 -0.295763
C  5.07523 0.016994 0.526325
C  -3.747093 2.604638 -1.127757
C  -4.437769 -2.64477 -0.456069
C  -4.035207 3.332588 0.188074
C  -4.849825 -2.93751 0.989691
H  0.489823 1.416211 -0.338135
H  0.223381 -1.548294 0.062655
H  2.21598 -1.894749 0.374921
H  5.140753 2.174812 0.238494
H  6.148848 -0.092237 0.69631
H  -4.660792 2.449199 -1.72303
H  -2.983436 3.1350 -1.722352
H  -3.864617 -3.484307 -0.8868
H  -5.304623 -2.404258 -1.092118
H  -3.106409 3.488669 0.761521
H  -4.747689 2.759371 0.805897
H  -4.480154 4.322457 -0.024977
H  -3.968598 -3.187151 1.603692
H  -5.542967 -3.799151 1.01308
H  -5.363968 -2.06814 1.434765
