program: Gaussian 09
title: 000282938
version: EM64L-G09RevD.01
frameworkgroup: C1[X(C14H15NO4)]
method: RPBEPBE
basis: SDD
operation: Freq
keyword: #p
keyword: freq=noraman
keyword: PBEPBE/SDD
title: #p freq=noraman PBEPBE/SDD
converged: YES YES NO NO
title: Mulliken charges:
elementType: O O O O N C C C C C C C C C C C C C C H H H H H H H H H H H H H H H
charge: -0.305970 -0.300992 -0.188158 -0.200462 -0.210681 -0.584176 -0.364976 0.554534 -0.549191 -0.396402 0.192281 0.180485 0.224754 0.179341 -0.336175 -0.251925 -0.250675 -0.530083 -0.530556 0.258210 0.220407 0.248514 0.242295 0.262708 0.231210 0.248596 0.274163 0.274224 0.218580 0.255213 0.229526 0.253232 0.229272 0.222878
chargesum: 0.00000
title: Mulliken charges with hydrogens summed into heavy atoms:
elementType: O O O O N C C C C C C C C C C C C C C
charge: -0.305970 -0.300992 -0.188158 -0.200462 -0.210681 -0.105559 0.125833 0.554534 -0.286483 -0.165191 0.192281 0.180485 0.224754 0.179341 -0.087579 0.022237 0.023549 0.173236 0.174826
polarizability: 1.70922752e+02 -1.03713946e+01 1.67048122e+02 -2.48114429e+01 -1.06371966e+01 1.48647050e+02
1716.lowfreq: -0.0007 -0.0007 -0.0005 0.9514 7.6603 10.7893 15.1443 25.2197 27.5152
frequency: 12.2051 25.1870 27.4661 63.2336 89.6725 105.3033 111.9097 121.4977 149.2525 163.0799 166.4941 186.5060 237.0245 263.3720 270.4499 294.1205 313.7237 341.8301 346.0496 379.2282 414.7539 445.3045 493.6847 521.0098 550.3957 572.4510 588.8005 626.6847 649.4855 687.2242 689.1048 702.8980 710.8614 736.8159 748.6939 818.2796 830.2498 854.0945 892.4824 924.9842 929.0409 939.7600 945.2313 955.0350 959.8717 994.8155 1029.4895 1054.7022 1091.2902 1108.0737 1113.4650 1114.9368 1125.5125 1143.9120 1153.9918 1157.5224 1194.7158 1212.1993 1245.7306 1266.4603 1278.7107 1285.1898 1341.6311 1347.8657 1369.0801 1376.2108 1401.2616 1424.0913 1443.0942 1456.9345 1459.0089 1461.3797 1477.2833 1479.0895 1487.4361 1488.3229 1575.2866 1580.9626 1614.7235 1619.4896 1675.4036 2969.1140 2971.5404 2997.2271 3011.3499 3062.2725 3065.5440 3067.3749 3081.5100 3119.9460 3120.3836 3126.2719 3141.1838 3162.0546 3203.6068 3232.4611
redmass: 5.2969 5.7540 8.2710 3.8555 4.2095 3.4660 3.7961 4.4445 2.2845 1.1801 1.5315 2.8339 4.9255 2.9044 4.6680 4.2652 2.6732 6.6132 4.3440 5.1704 5.6618 3.3298 3.5191 4.0459 4.2327 4.6902 6.3898 2.3923 3.4241 5.6341 5.8187 3.8396 5.8795 7.0411 3.5539 1.9760 1.4874 3.5044 1.7524 2.4430 2.2043 1.3102 5.8601 1.5339 3.8728 2.7759 1.5962 2.1084 2.7840 2.4600 1.2429 1.2490 2.4247 1.4236 1.3213 1.5408 1.8262 1.3794 2.2293 2.2409 1.6176 1.6347 1.3746 2.4696 5.8916 1.9729 2.1537 1.1742 1.3741 1.0537 1.0693 1.1113 1.0685 1.1234 1.6975 1.4032 7.1892 6.9397 6.8342 10.8860 10.6041 1.0313 1.0311 1.0622 1.0606 1.1014 1.1031 1.1039 1.1023 1.1027 1.1027 1.0891 1.0918 1.0955 1.0894 1.1107
irintensity: 0.0217 0.0648 0.1653 4.2798 1.4634 11.4897 0.4960 5.8393 3.1215 0.1448 1.3899 9.3122 3.9936 5.1234 4.3526 0.0369 2.4567 14.7716 0.1415 3.1486 8.5315 4.9971 7.1506 3.5342 0.1828 9.2327 4.6058 3.2799 9.4833 12.3019 10.2385 20.5140 8.7107 0.2213 2.7088 78.0053 43.4193 5.6739 18.5027 21.8071 5.6360 0.0119 49.0466 7.5750 29.8028 27.9413 13.2051 15.4761 48.4150 40.9457 12.6091 3.0598 3.4450 5.1416 0.5898 6.9440 51.7134 3.9784 81.7011 52.1782 11.8606 13.4342 18.6210 96.8634 20.6611 79.2933 20.5895 0.4823 20.2602 14.5506 1.7981 17.4984 10.9564 10.4835 35.1023 107.9887 9.0301 5.3908 19.3700 385.7021 4.1076 85.2107 58.5288 13.6640 48.9517 8.9103 32.2332 23.4834 8.9094 22.4129 25.2444 11.6995 4.6834 7.0148 0.0015 0.8968
temp: 298.150 k
press: 1.00000 atm
elementType: 8 8 8 8 7 6 6 6 6 6 6 6 6 6 6 6 6 6 6 1 1 1 1 1 1 1 1 1 1 1 1 1 1 1
symmnumber: 1
zpe: 692852.6 jmol-1
zpe.correction: 0.263894 hartree
zpe.thermalcorrener: 0.282373 hartree
zpe.thermalcorrenthalpy: 0.283317 hartree
zpe.thermalcorrgfe: 0.214679 hartree
zpe.sumelectzpe: -896.707208 hartree
zpe.sumelectthermal: -896.688729 hartree
zpe.sumelectthermalent: -896.687784 hartree
zpe.sumelectthermalfe: -896.756423 hartree
dipole: -0.4079 1.1595 0.3294
dipole: 1.2725
quadrupole: -102.6403 -93.7222 -126.2473
quadrupole: 0.1160 4.8186 7.0933
quadrupole: 4.8963 13.8144 -18.7107 0.1160 4.8186 7.0933
hfenergy: -896.9711015 hartree
pointgroup: C01 [X(C14H15N1O4)]
dipole: -0.1208837 -0.4834165 -0.0484243 debye
polarizability: 171.1228567|13.962207|165.8320209|22.8054726|-11.7445801|149.6630467 unknown
InChI: InChI=1S/C14H15NO4/c1-18-11-4-3-10(9-12(11)19-2)7-8-15-13(16)5-6-14(15)17/h3-6,9H,7-8H2,1-2H3
charge 0 multiplicity 1
34 atoms
O  -2.119967 -1.57874 1.381285
O  -3.872206 -0.390089 -0.649768
O  1.880694 0.240424 -2.62362
O  3.399683 -0.005764 1.815218
N  2.549159 0.497159 -0.350711
C  1.094737 2.177888 0.848204
C  2.238615 1.924188 -0.174607
C  -0.214572 1.503147 0.469127
C  -0.598734 0.285565 1.081718
C  -1.056712 2.051113 -0.533036
C  2.326841 -0.233935 -1.551155
C  3.085694 -0.352301 0.647787
C  -1.793891 -0.370912 0.717389
C  -2.65469 0.214633 -0.25447
C  -2.26593 1.416176 -0.88527
C  2.756265 -1.652102 -1.263406
C  3.202384 -1.720829 0.020146
C  -2.214076 -2.761893 0.494745
C  -4.884234 -0.497767 0.427555
H  1.433362 1.838388 1.842838
H  0.960967 3.275448 0.90649
H  1.960399 2.302207 -1.174386
H  3.152312 2.448818 0.160641
H  0.025525 -0.177127 1.854935
H  -0.773773 2.986063 -1.031461
H  -2.934466 1.840156 -1.641459
H  2.69389 -2.435409 -2.018934
H  3.593905 -2.574795 0.573165
H  -1.225495 -2.978623 0.046293
H  -2.958794 -2.601144 -0.305463
H  -2.519821 -3.593573 1.147713
H  -4.489486 -1.069168 1.286982
H  -5.739874 -1.020961 -0.025954
H  -5.193014 0.51156 0.759768
